[NLUUG]   Welcome to ftp.nluug.nl
Current directory: /ftp/vim/patches/8.2/
 
Current bandwidth utilization 112.26 Mbit/s
Bandwidth utilization bar
Contents of README:
Patches for Vim - Vi IMproved 8.2

The files in this directory contain source code changes to fix problems
in a released version of Vim.  Each file also contains an explanation of
the problem that is fixed, like the message that was sent to the vim-dev
maillist.

The best is to apply the patches in sequence.  This avoids problems when
a patch depends on a previous patch. 

Before patching, change to the top Vim directory, where the "src" and
"runtime" directories are located.
Depending on the version of "patch" that you use, you may have add an
argument to make it patch the right file:
        patch -p < 8.2.0001
        patch -p0 < 8.2.0001

After applying a patch, you need to compile Vim.  There are no patches
for binaries.

Checksums for the patch files can be found in the file MD5SUMS.


Individual patches for Vim 8.2:

  SIZE  NAME      FIXES
  1549  8.2.0001  #endif comments do not reflect corresponding #ifdef
  2457  8.2.0002  "dj" only deletes first line of closed fold
 16851  8.2.0003  Build file dependencies are incomplete
 16584  8.2.0004  get E685 and E931 if buffer reload is interrupted
  4131  8.2.0005  duplication in version info
  1891  8.2.0006  test using long file name may fail
  4669  8.2.0007  popup menu positioned wrong with folding in two tabs
 11490  8.2.0008  test72 is old style
  3996  8.2.0009  VMS: terminal version doesn't build
 88183  8.2.0010  test64 is old style
  5133  8.2.0011  screen updating wrong when opening preview window
  3423  8.2.0012  some undo functionality is not tested
 17191  8.2.0013  not using a typedef for condstack
 27932  8.2.0014  test69 and test95 are old style
  4754  8.2.0015  not all modeline variants are tested
  1758  8.2.0016  test name used twice, option not restored properly
 48904  8.2.0017  OS/2 and MS-DOS are still mentioned
  2620  8.2.0018  :join does not add white space where it should
  2951  8.2.0019  cannot get number of lines of another buffer
 15312  8.2.0020  mouse clicks in the command line not tested
  3528  8.2.0021  timer test fails too often on Travis with MacOS
  2040  8.2.0022  click in popup window doesn't close it in the GUI
  8371  8.2.0023  command line editing not sufficiently tested
  2104  8.2.0024  filetype Rego not recognized
  1743  8.2.0025  repeated word in comment
292321  8.2.0026  still some /* */ comments
 21092  8.2.0027  still some /* */ comments
  9858  8.2.0028  searchpairpos() is not tested
  3228  8.2.0029  MS-Windows: crash with empty job command
  3988  8.2.0030  "gF" does not work on output of "verbose command"
  2535  8.2.0031  MS-Windows: test for empty job fails
  2887  8.2.0032  MS-Windows: test for blank job fails
  1890  8.2.0033  crash when make_extmatch() runs out of memory
  1798  8.2.0034  missing check for out of memory
 18917  8.2.0035  saving and restoring called_emsg is clumsy
  3171  8.2.0036  not enough test coverage for match functions
  1470  8.2.0037  missing renamed message
  7827  8.2.0038  spell suggestions insufficiently tested
  2696  8.2.0039  memory access error when "z=" has no suggestions
  1763  8.2.0040  timers test is still flaky on Travis for Mac
  2338  8.2.0041  leaking memory when selecting spell suggestion
  1903  8.2.0042  clearing funccal values twice
  1847  8.2.0043  timers test is still flaky on Travis for Mac
 16697  8.2.0044  expression type is used inconsistently
  5301  8.2.0045  script test fails
  9537  8.2.0046  tests for spell suggestions are slow
  6978  8.2.0047  cannot skip tests for specific MS-Windows platform
  1795  8.2.0048  another timers test is flaky on Travis for Mac
  6632  8.2.0049  command line completion not fully tested
  3813  8.2.0050  after deleting a file mark it is still in viminfo
  1913  8.2.0051  command line completion test skipped
  5964  8.2.0052  more-prompt not properly tested
  2507  8.2.0053  windowsversion() does not always return the right value
  6617  8.2.0054  :diffget and :diffput don't have good completion
  2339  8.2.0055  cannot use ":gui" in vimrc with VIMDLL enabled
 62363  8.2.0056  execution stack is incomplete and inefficient
  2705  8.2.0057  cannot build with small features
  1792  8.2.0058  running tests changes ~/.viminfo
  1790  8.2.0059  compiler warnings for unused variables in small build
  2342  8.2.0060  message test only runs with one encoding
  1992  8.2.0061  the execute stack can grow big and never shrinks
  1670  8.2.0062  memory test is flaky on FreeBSD
  1725  8.2.0063  wrong size argument to vim_snprintf()
  6388  8.2.0064  diffmode completion doesn't use per-window setting
  4026  8.2.0065  Amiga and alikes: autoopen only used on Amiga OS4
  7675  8.2.0066  some corners of vim_snprintf() are not tested
 11234  8.2.0067  ERROR_UNKNOWN clashes on some systems
  2106  8.2.0068  crash when using Python 3 with "utf32" encoding
 15191  8.2.0069  ETYPE_ is used for two different enums
  2157  8.2.0070  crash when using Python 3 with "debug" encoding
  2547  8.2.0071  memory test often fails on Cirrus CI
  1636  8.2.0072  memory test still fails on Cirrus CI
  5381  8.2.0073  initializing globals with COMMA is clumsy
  4069  8.2.0074  Python 3 unicode test sometimes fails
  1718  8.2.0075  Python 3 unicode test still sometimes fails
  1723  8.2.0076  Python 3 unicode test fails on MS-Windows
  6570  8.2.0077  settagstack() cannot truncate at current index
  2748  8.2.0078  expanding <sfile> works differently the second time
  1522  8.2.0079  Python 3 unicode test still fails on MS-Windows
  4043  8.2.0080  globals using INIT4() are not in the tags file
  2087  8.2.0081  MS-Windows also need the change to support INIT4()
  2490  8.2.0082  when reusing a buffer listeners are not cleared
  4166  8.2.0083  text properties wrong when tabs and spaces are exchanged
 19804  8.2.0084  complete item "user_data" can only be a string
  3918  8.2.0085  dead code in builtin functions
  2720  8.2.0086  build error for small version
  4305  8.2.0087  crash in command line expansion when out of memory
 16660  8.2.0088  insufficient tests for tags; bug in using extra tag field
  1929  8.2.0089  crash when running out of memory in :setfiletype completion
  1620  8.2.0090  generated files show up in git status
  1869  8.2.0091  compiler warnings for size_t / int types
  8314  8.2.0092  tags functionality insufficiently tested
  2283  8.2.0093  win_splitmove() can make Vim hang
  1516  8.2.0094  MS-Windows: cannot build with Strawberry Perl 5.30
  4518  8.2.0095  cannot specify exit code for :cquit
 13631  8.2.0096  cannot create tiny popup window in last column
  2839  8.2.0097  crash with autocommand and spellfile
  9421  8.2.0098  exe stack length can be wrong without being detected
  2308  8.2.0099  use of NULL pointer when out of memory
 33959  8.2.0100  macros for Ruby are too complicated
  2370  8.2.0101  crash when passing null object to ":echomsg"
  1640  8.2.0102  messages test fails in small version
  3930  8.2.0103  using null object with execute() has strange effects
  2581  8.2.0104  using channel or job with ":execute" has strange effects
  6703  8.2.0105  Vim license not easy to find on github
  8812  8.2.0106  printf formats are not exactly right
  1594  8.2.0107  hgignore is out of sync from gitignore
  5148  8.2.0108  when sign text is changed a manual redraw is needed
  5565  8.2.0109  corrupted text properties when expanding spaces
 16846  8.2.0110  prop_find() is not implemented
 22059  8.2.0111  VAR_SPECIAL is also used for booleans
  2242  8.2.0112  illegal memory access when using 'cindent'
  3850  8.2.0113  "make cmdidxs" fails
  9974  8.2.0114  info about sourced scripts is scattered
  5139  8.2.0115  byte2line() does not work correctly with text properties
  4725  8.2.0116  BufEnter autocmd not triggered on ":tab drop"
  2345  8.2.0117  crash when using gettabwinvar() with invalid arguments
  5488  8.2.0118  crash when cycling to buffers involving popup window 
  1817  8.2.0119  message test fails on some platforms
  4225  8.2.0120  virtcol() does not check arguments to be valid
  4274  8.2.0121  filter() and map() on blob don't work
  8376  8.2.0122  readme files still mention MS-DOS
  4034  8.2.0123  complete_info() does not work when CompleteDone is triggered
  1979  8.2.0124  compiler warnings for variable types
  6470  8.2.0125  :mode no longer works for any system
  1594  8.2.0126  textprop test fails
  3187  8.2.0127  some buffer commands work in a popup window
 12194  8.2.0128  cannot list options one per line
  4494  8.2.0129  MS-Windows installer doesn't use Turkish translations
  2939  8.2.0130  Python3 ranges are not tested
  4110  8.2.0131  command line is not cleared when switching tabs
  3176  8.2.0132  script may be re-used when deleting and creating a new one
  2427  8.2.0133  invalid memory access with search command
  4359  8.2.0134  some map functionality not covered by tests
  2303  8.2.0135  bracketed paste can still cause invalid memory access
  1801  8.2.0136  stray ch_logfile() call
  3314  8.2.0137  crash when using win_execute() from a new tab
  2260  8.2.0138  memory leak when starting a job fails
  2015  8.2.0139  MS-Windows: default for IME is inconsistent
  9953  8.2.0140  CI does not test building doc tags
  2689  8.2.0141  no swift filetype detection
  5532  8.2.0142  possible to enter popup window with CTRL-W p
  1694  8.2.0143  Coverity warning for possible use of NULL pointer
 12830  8.2.0144  some mapping code is not fully tested
  2733  8.2.0145  using #error for compilation errors should be OK now
  3285  8.2.0146  wrong indent when 'showbreak' and 'breakindent' are set
  4848  8.2.0147  block Visual mode operators not correct when 'linebreak' set
  8058  8.2.0148  mapping related function in wrong source file
546902  8.2.0149  maintaining a Vim9 branch separately is more work
  2924  8.2.0150  cannot define python function when using :execute
  5948  8.2.0151  detecting a script was already sourced is unreliable
  2328  8.2.0152  restoring ctrl_x_mode is not needed
  2128  8.2.0153  warning shows when listing version info
 21204  8.2.0154  reallocating the list of scripts is inefficient
  5718  8.2.0155  warnings from MinGW compiler; tests fail without +float
 35557  8.2.0156  various typos in source files and tests
  1822  8.2.0157  Vim9 script files not in list of distributed files
  8411  8.2.0158  triggering CompleteDone earlier is not backwards compatible
 19352  8.2.0159  non-materialized range() list causes problems
  1989  8.2.0160  range test fails
  2619  8.2.0161  not recognizing .gv file as dot filetype
  1730  8.2.0162  balloon test fails in the GUI
  2779  8.2.0163  test hangs on MS-Windows console
  6803  8.2.0164  test_alot takes too long
  1586  8.2.0165  Coverity warning for using NULL pointer
  1738  8.2.0166  Coverity warning for using uninitialized variable
  2056  8.2.0167  Coverity warning for ignoring return value
  1918  8.2.0168  Coverity warning for assigning NULL to an option
  1546  8.2.0169  Coverity warning for dead code
  2419  8.2.0170  Coverity warning for ignoring return value
  1566  8.2.0171  Coverity warning for using uninitialized buffer
  1958  8.2.0172  Coverity warning for not restoring character
 28537  8.2.0173  build fails with old compiler
 15856  8.2.0174  various commands not completely tested
  2955  8.2.0175  crash when removing list element in map()
  1429  8.2.0176  generating os headers does not work for Swedish
  1548  8.2.0177  memory leak in get_tags()
  4310  8.2.0178  with VTP the screen may not be restored properly
 17652  8.2.0179  still a few places where range() does not work
  1720  8.2.0180  test for wrapmargin fails if terminal is not 80 columns
 17654  8.2.0181  problems parsing :term arguments
  2252  8.2.0182  min() and max() materialize a range() list
 60266  8.2.0183  tests fail when the float feature is disabled
  1590  8.2.0184  blob test fails
 16105  8.2.0185  Vim9 script: cannot use "if has()" to skip lines
  2393  8.2.0186  a couple of tests may fail when features are missing
  1850  8.2.0187  reduntant code
  8482  8.2.0188  Check commands don't work well with Vim9 script
  2087  8.2.0189  cd() with NULL argument crashes
  2564  8.2.0190  Kotlin files are not recognized
 31598  8.2.0191  cannot put a terminal in a popup window
  3621  8.2.0192  build failure without +terminal feature
  1938  8.2.0193  still build failure without +terminal feature
 10759  8.2.0194  some commands can cause problems in terminal popup
  2900  8.2.0195  some tests fail when run in the GUI
  5288  8.2.0196  blocking commands for a finished job in a popup window
 10593  8.2.0197  some Ex commands not sufficiently tested
  3151  8.2.0198  no tests for y/n prompt
  5865  8.2.0199  Vim9 script commands not sufficiently tested
 26806  8.2.0200  Vim9 script commands not sufficiently tested
 18634  8.2.0201  cannot assign to an imported variable
  1417  8.2.0202  when 'lazyredraw' is set the window title may not be updated
 11345  8.2.0203  :helptags and some other functionality not tested
  3391  8.2.0204  crash when using winnr('j') in a popup window
  2126  8.2.0205  error code E899 used twice
  4162  8.2.0206  calling Vim9 function using default argument fails
  4686  8.2.0207  crash when missing member type on list argument
  6927  8.2.0208  fnamemodify() does not apply ":~" when followed by ":."
  4772  8.2.0209  function a bit far away from where it's used
  1736  8.2.0210  Coverity complains about uninitialized field
  2762  8.2.0211  test for ANSI colors fails without an "ls" command
 10146  8.2.0212  missing search/substitute pattern hardly tested
  3497  8.2.0213  configure does not recognize gcc 10.0 and later
  4637  8.2.0214  a popup window with a terminal can be made hidden
  2675  8.2.0215  wrong file name shortening
  5306  8.2.0216  several Vim9 instructions are not tested
  1817  8.2.0217  terminal test fails on Mac
  6678  8.2.0218  several Vim9 instructions are not tested
  2103  8.2.0219  terminal test still fails on Mac
  2078  8.2.0220  terminal test did pass on Mac
  3281  8.2.0221  no test for Vim9 += and ..=
 16301  8.2.0222  Vim9: optional function arguments don't work yet
 19305  8.2.0223  some instructions not yet tested
  5603  8.2.0224  compiling :elseif not tested yet
  4828  8.2.0225  compiling lambda not tested yet
  3825  8.2.0226  compiling for loop not tested
  3870  8.2.0227  compiling a few instructions not tested
  2846  8.2.0228  configure does not recognize gcc version on BSD
 11790  8.2.0229  compare instructions not tested
  1806  8.2.0230  terminal popup test is flaky
  1961  8.2.0231  silent system command may clear the screen
  2709  8.2.0232  the :compiler command causes a crash
 12940  8.2.0233  crash when using garbagecollect() in between rand()
  2512  8.2.0234  message test fails on SunOS
  2936  8.2.0235  draw error when an empty group is removed from 'statusline'
  1768  8.2.0236  MS-Windows uninstall doesn't delete vimtutur.bat
  2231  8.2.0237  crash when setting 'wincolor' on finished terminal window
  2798  8.2.0238  MS-Windows: job_stop() results in exit value zero
  3106  8.2.0239  MS-Windows: 'env' job option does not override existing vars
  3881  8.2.0240  using memory after it was freed
  2064  8.2.0241  crash when setting 'buftype' to "quickfix"
  2147  8.2.0242  preview popup window test fails with long directory name
 22438  8.2.0243  insufficient code coverage for ex_docmd.c functions
  1994  8.2.0244  compiler warning in Lua interface
  1725  8.2.0245  MSVC: error message if the auto directory already exists
  5304  8.2.0246  MSVC: deprecation warnings with Ruby
  1808  8.2.0247  misleading comment in NSIS installer script
  5569  8.2.0248  MS-Windows: dealing with deprecation is too complicated
  2652  8.2.0249  MS-Windows: various warnings
  7215  8.2.0250  test_clear_search_pat() is unused
  4121  8.2.0251  a couple of function return types can be more specific
  2092  8.2.0252  Windows compiler warns for using size_t
  3477  8.2.0253  crash when using :disassamble without argument
  1763  8.2.0254  compiler warning for checking size_t to be negative
  2635  8.2.0255  VMS: missing files in build
 68712  8.2.0256  time and timer related code is spread out
  8540  8.2.0257  cannot recognize a terminal in a popup window
  6070  8.2.0258  modifyOtherKeys cannot be temporarily disabled
  2932  8.2.0259  terminal in popup test sometimes fails
 16546  8.2.0260  several lines of code are duplicated
 10871  8.2.0261  some code not covered by tests
  1617  8.2.0262  fileformat test fails on MS-Windows
  3205  8.2.0263  a few new Vim9 messages are not localized
  1845  8.2.0264  fileformat test still fails on MS-Windows
  1949  8.2.0265  "eval" after "if 0" doesn't check for following command
  1437  8.2.0266  terminal in popup test sometimes fails on Mac
  2107  8.2.0267  no check for a following cmd when calling a function fails
  1697  8.2.0268  trycatch test fails
  2877  8.2.0269  Vim9: operator after list index does not work
 24105  8.2.0270  some code not covered by tests
 14835  8.2.0271  the "num64" feature is available everywhere
  5481  8.2.0272  ":helptags ALL" gives error for some directories
  3732  8.2.0273  MS-Windows uninstall may delete wrong batch file
  2875  8.2.0274  hang with combination of feedkeys(), Ex mode and :global
  8120  8.2.0275  some Ex code not covered by tests
  3469  8.2.0276  Vim9: not allowing space before ")" in function call
  5067  8.2.0277  Vim9: not all instructions covered by tests
  1932  8.2.0278  channel test is flaky on Mac
  2150  8.2.0279  Vim9: no test for deleted :def function
  2155  8.2.0280  Vim9: throw in :def function not caught higher up
  4844  8.2.0281  two placed signs in the same line are not combined
  4136  8.2.0282  Vim9: setting number option not tested
  3668  8.2.0283  Vim9: failing to load script var not tested
  1579  8.2.0284  Vim9: assignment test fails
  6719  8.2.0285  unused error message; cannot create s:var
  7325  8.2.0286  cannot use popup_close() for a terminal popup
  2925  8.2.0287  Vim9: return in try block not tested; catch not tested
  8199  8.2.0288  Vim9: some float and blob operators not tested
  1390  8.2.0289  Vim9: :echo did not clear the rest of the line
  2419  8.2.0290  running individual test differs from all tests
  7996  8.2.0291  Vim9: assigning [] to list<string> doesn't work
  2267  8.2.0292  Vim9: CHECKNR and CHECKTYPE instructions not tested
 14618  8.2.0293  various Ex commands not sufficiently tested
 13597  8.2.0294  cannot use Ex command that is also a function name
 17226  8.2.0295  highlighting for :s wrong when using different separator
 19909  8.2.0296  mixing up "long long" and __int64 may cause problems
  2148  8.2.0297  compiler warnings for the Ruby interface
  5679  8.2.0298  Vim9 script: cannot start command with a string constant
  5897  8.2.0299  Vim9: ISN_STORE with argument not tested
  1754  8.2.0300  Vim9: expression test fails without channel support
  8193  8.2.0301  insufficient testing for exception handling
  3046  8.2.0302  setting 'term' may cause error in TermChanged autocommand
  1422  8.2.0303  TermChanged test fails in the GUI
  1878  8.2.0304  terminal test if failing on some systems
  3421  8.2.0305  relativenumber test fails on some systems
  2909  8.2.0306  Vim9: :substitute(pat(repl does not work in Vim9 script
  3011  8.2.0307  Python 3 vim.eval not well tested
  2565  8.2.0308  'showbreak' does not work for a very long line
  5888  8.2.0309  window-local values have confusing name
  2827  8.2.0310  autocmd test fails on a slow system
  2598  8.2.0311  Vim9: insufficient script tests
 12101  8.2.0312  Vim9: insufficient script tests
  5539  8.2.0313  Vim9: insufficient script tests
  1854  8.2.0314  short name not set for terminal buffer
  2997  8.2.0315  build failure on HP-UX system
  9089  8.2.0316  ex_getln.c code has insufficient test coverage
  1884  8.2.0317  MSVC: _CRT_SECURE_NO_DEPRECATE not defined on DEBUG build
  4475  8.2.0318  Vim9: types not sufficiently tested
  3544  8.2.0319  file missing in distribution, comments outdated
222244  8.2.0320  no Haiku support
  8639  8.2.0321  Vim9: ":execute" does not work yet
  5701  8.2.0322  Vim9: error checks not tested
  8478  8.2.0323  Vim9: calling a function that is defined later is slow
  8788  8.2.0324  text property not updated correctly when inserting/deleting
 10818  8.2.0325  ex_getln.c code not covered by tests
  1788  8.2.0326  compiler warning for using uninitialized variable
  2981  8.2.0327  crash when opening and closing two popup terminal windows
 15040  8.2.0328  no redraw when leaving term-normal mode in popup terminal
  3708  8.2.0329  popup filter converts 0x80 bytes
  1381  8.2.0330  build error with popup window but without terminal
  3220  8.2.0331  internal error when using test_void() and test_unknown()
  4519  8.2.0332  some code in ex_getln.c not covered by tests
  3982  8.2.0333  terminal in popup test is flaky
  6119  8.2.0334  abort called when using test_void()
  4242  8.2.0335  no completion for :disassemble
 12094  8.2.0336  Vim9: insufficient test coverage for compiling
  1555  8.2.0337  build fails on a few systems
  1477  8.2.0338  build failure without the channel feature
 74311  8.2.0339  Vim9: function return type may depend on arguments
  5078  8.2.0340  Vim9: function and partial types not tested
  3144  8.2.0341  using ":for" in Vim9 script gives an error
  5710  8.2.0342  some code in ex_getln.c not covered by tests
  4773  8.2.0343  Vim9: using wrong instruction, limited test coverage
  1480  8.2.0344  ":def" not skipped properly
  1500  8.2.0345  compiler warning when building without the float feature
  7931  8.2.0346  Vim9: finding common list type not tested
 10476  8.2.0347  various code not covered by tests
 10799  8.2.0348  Vim9: not all code tested
  3030  8.2.0349  Vim9: constant expression not well tested
 22031  8.2.0350  Vim9: expression tests don't use recognized constants
  1512  8.2.0351  terminal in popup test is still a bit flaky
  4177  8.2.0352  FreeBSD: test for sourcing utf-8 is skipped
  2687  8.2.0353  Vim9: while loop not tested
  1469  8.2.0354  Python 3.9 does not define _Py_DEC_REFTOTAL
  4404  8.2.0355  Vim9: str_val is confusing, it's a number
  6740  8.2.0356  MS-Windows: feedkeys() with VIMDLL cannot handle CSI
  4030  8.2.0357  cannot delete a text property matching both id and type
  8982  8.2.0358  insufficient testing for indent.c
  2237  8.2.0359  popup_atcursor() may hang
  1942  8.2.0360  yaml files are only recognized by the file extension
  3125  8.2.0361  internal error when using "0" for a callback
  2175  8.2.0362  MS-Windows: channel test fails if grep is not available
 22535  8.2.0363  some Normal mode commands not tested
  2530  8.2.0364  printf test failing on Haiku
  4851  8.2.0365  tag kind can't be a multi-byte character
  7335  8.2.0366  hardcopy command not tested enough
  2149  8.2.0367  can use :pedit in a popup window
  7477  8.2.0368  Vim9: import that redefines local variable does not fail
 34492  8.2.0369  various Normal mode commands not fully tested
  2417  8.2.0370  the typebuf_was_filled flag is sometimes not reset
  6732  8.2.0371  crash with combination of terminal popup and autocmd
  4466  8.2.0372  prop_find() may not find text property at start of the line
  2526  8.2.0373  type of term_sendkeys() is unknown
  1534  8.2.0374  using wrong printf directive for jump location
  3338  8.2.0375  Coverity warning for not using return value
  1462  8.2.0376  nasty callback test fails on some systems
  2933  8.2.0377  no CI test for a big-endian system
  2701  8.2.0378  prop_find() does not find all props
  1792  8.2.0379  gcc warns for ambiguous else
  5731  8.2.0380  tiny popup when creating a terminal popup without minwidth
  2771  8.2.0381  using freed memory with :lvimgrep and autocommand
 11662  8.2.0382  some tests fail when run under valgrind
  1593  8.2.0383  wrong feature check causes test not to be run
  3707  8.2.0384  Travis CI has warnings
 38895  8.2.0385  menu functionality insufficiently tested
  1773  8.2.0386  part from unfinished patch got included
  2338  8.2.0387  error for possible NULL argument to qsort()
  6692  8.2.0388  printmbcharset option not tested
  1597  8.2.0389  delayed redraw when shifting text from Insert mode
  6796  8.2.0390  terminal postponed scrollback test is flaky
  2615  8.2.0391  CI test coverage dropped
  3116  8.2.0392  Coverity warns for using array index out of range
  2211  8.2.0393  Coverity warns for not using return value
  1671  8.2.0394  Coverity complains about using NULL pointer
  1833  8.2.0395  build fails with FEAT_EVAL but without FEAT_MENU
 12909  8.2.0396  cmdexpand.c insufficiently tested
  2502  8.2.0397  delayed screen update when using undo from Insert mode
  5040  8.2.0398  profile test fails when two functions take same time
  4842  8.2.0399  various memory leaks
  4248  8.2.0400  not all tests using a terminal are in the list of flaky tests
 17132  8.2.0401  not enough test coverage for evalvars.c
  3478  8.2.0402  setting local instead of global flag
  2868  8.2.0403  when 'buftype' is "nofile" there is no overwrite check
  2048  8.2.0404  writefile() error does not give a hint
  3073  8.2.0405  MSVC: build fails with some combination of features
  2253  8.2.0406  FileReadCmd event not well tested
  4043  8.2.0407  no early check if :find and :sfind have an argument
  1381  8.2.0408  delete() commented out for testing
 13412  8.2.0409  search test leaves file behind
  2012  8.2.0410  channel test fails too often on slow Mac
  1822  8.2.0411  Mac: breakcheck is using a value from the stone ages
  2909  8.2.0412  MS-Windows: cannot use vimtutor from the start menu
 20994  8.2.0413  buffer menu does not handle special buffers properly
  5532  8.2.0414  channel connect_waittime() test is flaky
  3208  8.2.0415  bsdl filetype is not detected
  1592  8.2.0416  test leaves file behind
  8668  8.2.0417  Travis CI config can be improved
 20647  8.2.0418  code in eval.c not sufficiently covered by tests
 18711  8.2.0419  various memory leaks in Vim9 script code
  3066  8.2.0420  Vim9: cannot interrupt a loop with CTRL-C
  4020  8.2.0421  interrupting with CTRL-C does not always work
  2571  8.2.0422  crash when passing popup window to win_splitmove()
  5553  8.2.0423  in some environments a few tests are expected to fail
  2485  8.2.0424  checking for wrong return value
 51025  8.2.0425  code for modeless selection not sufficiently tested
  5649  8.2.0426  some errors were not tested for
 37995  8.2.0427  it is not possible to check for a typo in a feature name
  2844  8.2.0428  buffer name may leak
  1567  8.2.0429  no warning when test checks for option that never exists
  5262  8.2.0430  window creation failure not properly tested
  1993  8.2.0431  some compilers don't support using \e for Esc
  6156  8.2.0432  a few tests fail in a huge terminal
  5088  8.2.0433  INT signal not properly tested
  1453  8.2.0434  MS-Windows with VTP: Normal color not working
  2069  8.2.0435  channel contents might be freed twice
 13442  8.2.0436  no warnings for incorrect printf arguments
  6700  8.2.0437  MS-Windows installer contains old stuff
  2671  8.2.0438  terminal noblock test is very flaky on BSD
  5108  8.2.0439  :disassemble has minor flaws
  3341  8.2.0440  terminal noblock test is still very flaky on BSD
  2913  8.2.0441  terminal noblock test is still failing on BSD
  2756  8.2.0442  channel contents might be used after being freed
138665  8.2.0443  clipboard code is spread out
  3318  8.2.0444  swap file test fails on some systems
  2354  8.2.0445  png and xpm files not in MS-Windows zip file
  2469  8.2.0446  listener with undo of deleting all lines not tested
  2376  8.2.0447  terminal scroll tests fails on some systems
 24985  8.2.0448  various functions not properly tested
  3011  8.2.0449  Vim9: crash if return type is invalid
 11029  8.2.0450  not enough testing for restricted mode and function calls
  1616  8.2.0451  Win32: double-width character displayed incorrectly
  2272  8.2.0452  channel_parse_messages() fails when called recursively
  3245  8.2.0453  trailing space in job_start() command causes empty argument
  6485  8.2.0454  some tests fail when the system is slow
 19952  8.2.0455  cannot set the highlight group for a specific terminal
  2705  8.2.0456  Test_confirm_cmd is flaky
  2425  8.2.0457  Test_quotestar() often fails when run under valgrind
  1622  8.2.0458  missing feature check in test function
 47687  8.2.0459  cannot check if a function name is correct
  2644  8.2.0460  build failure because of wrong feature name
  1571  8.2.0461  confirm test fails on amd64 system
  3344  8.2.0462  previewwindow test fails on some systems
  2512  8.2.0463  build error without float and channel feature
  5648  8.2.0464  typos and other small problems
  5874  8.2.0465  Vim9: dead code and wrong return type
  4471  8.2.0466  not parsing messages recursively breaks the govim plugin
  8203  8.2.0467  Vim9: some errors are not tested
  7139  8.2.0468  GUI: pixel dust with some fonts and characters
  4360  8.2.0469  Vim9: no error for missing ] after list
  1964  8.2.0470  Test_confirm_cmd_cancel() can fail on a slow system
  1742  8.2.0471  missing change to compile_list()
  1387  8.2.0472  terminal highlight name is set twice, leaking memory
  3546  8.2.0473  variables declared in an outer scope
  3388  8.2.0474  cannot use :write when using a plugin with BufWriteCmd
  2200  8.2.0475  channel out_cb test still fails sometimes on Mac
  2355  8.2.0476  terminal nasty callback test fails sometimes
  3314  8.2.0477  Vim9: error messages not tested
  4593  8.2.0478  new buffers are not added to the Buffers menu
  4619  8.2.0479  unloading shared libraries on exit has no purpose
  3494  8.2.0480  Vim9: some code is not tested
  7070  8.2.0481  Travis is still using trusty
 31807  8.2.0482  channel and sandbox code not sufficiently tested
  2688  8.2.0483  Vim9: "let x = x + 1" does not give an error
  2872  8.2.0484  Vim9: some error messages not tested
  2494  8.2.0485  Vim9 script test fails
  7966  8.2.0486  Vim9: some code and error messages not tested
  9517  8.2.0487  Vim9: compiling not sufficiently tested
  5274  8.2.0488  Vim9: compiling can break when using a lambda inside :def
  6260  8.2.0489  Vim9: memory leaks
  1753  8.2.0490  Win32: VTP doesn't respect 'restorescreen'
  4764  8.2.0491  cannot recognize a <script> mapping using maparg()
  8956  8.2.0492  Vim9: some error messages not tested
 10688  8.2.0493  Vim9: some error messages not tested
  1658  8.2.0494  Vim9: asan error
  4771  8.2.0495  Vim9: some code not tested
  3400  8.2.0496  Vim9: disassemble test fails
  2604  8.2.0497  too verbose output from the asan build in Travis
  1734  8.2.0498  Coverity complains about uninitialized field
  9226  8.2.0499  calling a lambda is slower than evaluating a string
 66291  8.2.0500  using the same loop in many places
  1898  8.2.0501  Vim9: script test fails when channel feature is missing
 19346  8.2.0502  Vim9: some code is not tested
  7976  8.2.0503  Vim9: some code is not tested
  2309  8.2.0504  Vim9: leaking scope memory when compilation fails
  3719  8.2.0505  term_getty() not sufficiently tested
  1633  8.2.0506  Coverity complains about ignoring return value
  2762  8.2.0507  getbufvar() may get the wrong dictionary
 30864  8.2.0508  Vim9: func and partial types not done yet
 24280  8.2.0509  various code is not properly tested.
  2440  8.2.0510  Coverity complains about using uninitialized variable
 16222  8.2.0511  Cscope code not fully tested
 59487  8.2.0512  Vim9: no optional arguments in func type
  2963  8.2.0513  reading past allocated memory when using varargs
  7872  8.2.0514  several global functions are used in only one file
  3269  8.2.0515  some compilers cannot add to "void *"
 62078  8.2.0516  client-server code is spread out
 20530  8.2.0517  Vim9: cannot separate "func" and "func(): void"
  2171  8.2.0518  a terminal falls back to setting $TERM to "xterm"
  3535  8.2.0519  Vim9: return type not properly checked
  1684  8.2.0520  tests are not listed in sorted order
  3372  8.2.0521  crash when reading a blob fails
 19080  8.2.0522  several errors are not tested for
 24711  8.2.0523  loops are repeated
  4202  8.2.0524  Win32: searching for file matches is slow
  2287  8.2.0525  Win32: typo in assignment and misplaced paren
  1987  8.2.0526  Gcc 9 complains about empty statement
 11280  8.2.0527  Vim9: function types insufficiently tested
  4916  8.2.0528  Vim9: function arguments insufficiently tested
  4079  8.2.0529  Vim9: function argument with default not checked
  2154  8.2.0530  test crashes on s390
 18580  8.2.0531  various errors not tested
  3815  8.2.0532  cannot use simplify() as a method
 80555  8.2.0533  tests using term_wait() can still be flaky
  1907  8.2.0534  client-server test fails under valgrind
 16365  8.2.0535  regexp patterns not fully tested
  7167  8.2.0536  Vim9: some compilation code not tested
  2870  8.2.0537  Vim9: no check for sandbox when setting v:var
  6495  8.2.0538  Vim9: VAR_PARTIAL is not used during compilation
  2704  8.2.0539  comparing two NULL list fails
 27185  8.2.0540  regexp and other code not tested
 12645  8.2.0541  Travis CI does not give compiler warnings
  2850  8.2.0542  no test for E386
 22793  8.2.0543  Vim9: function with varargs does not work properly
  1659  8.2.0544  memory leak in search test
  8952  8.2.0545  unused arguments ignored in non-standard way
  8179  8.2.0546  Vim9: varargs implementation is inefficient
  3456  8.2.0547  Win32: restoring screen not always done right
  6057  8.2.0548  Vim9: not all possible func type errors tested
  4029  8.2.0549  user systemd files not recognized
  3721  8.2.0550  some changes in the libvterm upstream code
  9085  8.2.0551  not all code for options is tested
  4613  8.2.0552  Vim9: some errors not covered by tests
  1797  8.2.0553  error for unused argument
  2903  8.2.0554  the GUI doesn't set t_Co
  7648  8.2.0555  Vim9: line continuation is not always needed
  1931  8.2.0556  Vim9: memory leak when finding common type
 57292  8.2.0557  no IPv6 support for channels
  2319  8.2.0558  Vim9: dict code not covered by tests
 79607  8.2.0559  clearing a struct is verbose
  2728  8.2.0560  compiler warning in tiny build
  7223  8.2.0561  Vim9: cannot split function call in multiple lines
 17585  8.2.0562  Vim9: cannot split an expression into multiple lines
  8350  8.2.0563  Vim9: cannot split a function line
  3563  8.2.0564  Vim9: calling a def function from non-vim9 may fail
 49216  8.2.0565  Vim9: tests contain superfluous line continuation
  2226  8.2.0566  Vim9: variable can be used uninitialized
 14904  8.2.0567  Vim9: cannot put comments halfway expressions
  4334  8.2.0568  the man filetype plugin overwrites the unnamed register
  1443  8.2.0569  build failure with tiny version
  6986  8.2.0570  Vim9: no error when omitting type from argument
  2107  8.2.0571  double free when passing invalid argument to job_start()
  1481  8.2.0572  using two lines for free and reset
  3947  8.2.0573  using :version twice leaks memory
  2479  8.2.0574  ipv6 feature not shown in :version output
  2199  8.2.0575  :digraph! not tested
  3186  8.2.0576  some errors are not covered by tests
 11063  8.2.0577  not all modifiers supported for :options
170171  8.2.0578  heredoc for interfaces does not support "trim"
  1949  8.2.0579  Coverity warns for unused value
  3352  8.2.0580  window size wrong if 'ea' is off and 'splitright' is on
  3366  8.2.0581  Win32 console: the cursor position is always top-left
  3881  8.2.0582  color ramp test does not show text colors
  5624  8.2.0583  Vim9: # comment not recognized in :def function
  1871  8.2.0584  viminfo file uses obsolete function file_readable()
  9320  8.2.0585  Vim9: # comment not recognized after :vim9script
  2928  8.2.0586  Vim9: # comment not sufficiently tested
  1514  8.2.0587  compiler warning for unused variable
  2896  8.2.0588  Putty does not use "sgr" 'ttymouse' by default
  2692  8.2.0589  .bsd file type not recognized
 10197  8.2.0590  no 'backspace' value allows ignoring the insertion point
  2078  8.2.0591  MS-Windows: should always support IPv6
  1452  8.2.0592  MS-Windows with VTP: cursor is not made invisible
  3454  8.2.0593  finding a user command is not optimal
  5569  8.2.0594  MS-Windows: cannot build with WINVER set to 0x0501
 13856  8.2.0595  Vim9: not all commands using ends_excmd() tested
  2578  8.2.0596  crash in test49
 11893  8.2.0597  test_eval is old style
  2095  8.2.0598  test_eval_stuff fails in normal terminal
 39503  8.2.0599  Netbeans interface insufficiently tested
 15104  8.2.0600  Vim9: cannot read or write w:, t: and b: variables
 18763  8.2.0601  Vim9: :unlet is not compiled
  5346  8.2.0602  :unlet $VAR does not work properly
  3436  8.2.0603  configure does not detect moonjit
  2555  8.2.0604  :startinsert in a terminal window used later
  5493  8.2.0605  Vim9: cannot unlet an environment variable
  6521  8.2.0606  several syntax HL errors not checked
  3281  8.2.0607  gcc warns for using uninitialized variable
  1825  8.2.0608  warning from clang when building message test
  2638  8.2.0609  configure does not detect moonjit correctly
 20102  8.2.0610  some tests are still old style
  4958  8.2.0611  Vim9: no check for space before #comment
 10955  8.2.0612  Vim9: no check for space before #comment
 19950  8.2.0613  Vim9: no check for space before #comment
 13804  8.2.0614  get ml_get error when deleting a line in 'completefunc'
 20671  8.2.0615  regexp benchmark stest is old style
  1630  8.2.0616  build error when disabling the diff feature
  2537  8.2.0617  new error check triggers in Swedish menu
  2449  8.2.0618  echoing a null list results in no output
 14373  8.2.0619  null dict is not handled like an empty dict
  5710  8.2.0620  error in menu translations
  2572  8.2.0621  after running tests asan files may remain
 12786  8.2.0622  Haiku: GUI does not compile
  1515  8.2.0623  typo in test comment
  8560  8.2.0624  Vim9: no check for space before #comment
  4724  8.2.0625  Vim9: confusing error when calling unknown function
 13965  8.2.0626  Vim9: wrong syntax of function in Vim9 script
  1400  8.2.0627  Vim9: error message does not work
 80527  8.2.0628  error in menu translations
  3002  8.2.0629  setting a boolean option to v:false does not work
  1243  8.2.0630  "make tags" does not cover Haiku GUI file
256246  8.2.0631  Haiku file formatted with wrong tabstop
  1446  8.2.0632  crash when using Haiku
 13635  8.2.0633  crash when using null partial in filter()
 19251  8.2.0634  crash with null partial and blob
  1648  8.2.0635  when using 256 colors DarkYellow does not show expected color
  1532  8.2.0636  :messages does not show the maintainer when $LANG is unset
  3257  8.2.0637  incsearch highlighting does not work for ":sort!"
  1522  8.2.0638  MS-Windows: messages test fails
  3529  8.2.0639  MS-Windows: messages test still fails
 42251  8.2.0640  Vim9: expanding `=expr` does not work
  5150  8.2.0641  Vim9: `=expr` not expanded in :hardcopy and syn-include
  2452  8.2.0642  Vim9: using invalid index
  2947  8.2.0643  terminal uses brown instead of dark yellow
 16983  8.2.0644  insufficient testing for invalid function arguments
  1885  8.2.0645  MS-Windows terminal: CTRL-C does not get to child job
  3028  8.2.0646  t_Co uses the value of $COLORS in the GUI
  2158  8.2.0647  MS-Windows: repeat count for events was not used
  2826  8.2.0648  semicolon search does not work in first line
  2820  8.2.0649  undo problem when an InsertLeave autocommand resets undo
 35386  8.2.0650  Vim9: script function can be deleted
  1496  8.2.0651  old style benchmark test still in list of distributed files
  2106  8.2.0652  compiler warning for char conversion
  4836  8.2.0653  using uninitialized pointer
  1488  8.2.0654  building with Python fails
 26350  8.2.0655  search code not sufficiently tested
  3410  8.2.0656  MS-Windows: redrawing right screen edge may not be needed
  6097  8.2.0657  Vim9: no check if called variable is a FuncRef
  1772  8.2.0658  HP-UX build fails when setenv() is not defined
  4013  8.2.0659  Vim9: no test for equal func type
118151  8.2.0660  the search.c file is a bit big
 24388  8.2.0661  eval test is still old style
  4767  8.2.0662  cannot use input() in a channel callback
  3841  8.2.0663  not all systemd temp files are recognized
  8718  8.2.0664  included undesired changes in Makefile
  6066  8.2.0665  wrongly assuming Python executable is called "python"
  3259  8.2.0666  Ruby test fails on MS-Windows
 26612  8.2.0667  cannot install Haiku version from source
  1562  8.2.0668  compiler warning for int/size_t usage
 16315  8.2.0669  MS-Windows: display in VTP is a bit slow
 20544  8.2.0670  cannot change window when evaluating 'completefunc'
  3380  8.2.0671  Haiku: compiler warnings
  5492  8.2.0672  heredoc in scripts does not accept lower case marker
  1726  8.2.0673  cannot build Haiku in shadow directory
 79652  8.2.0674  some source files are too big
 22831  8.2.0675  Vim9: no support for closures
  1641  8.2.0676  pattern in list of distributed files does not match
 23542  8.2.0677  Vim9: no support for closures
  1780  8.2.0678  rare crash for popup menu
 27973  8.2.0679  Vim9: incomplete support for closures
  6905  8.2.0680  PTYGROUP and PTYMODE are unused
  1493  8.2.0681  pattern for 'hlsearch' highlighting may leak
  1883  8.2.0682  Vim9: parsing function argument type can get stuck
  6353  8.2.0683  Vim9: parsing type does not always work
 12152  8.2.0684  Vim9: memory leak when using lambda
  2097  8.2.0685  Build failure
  7595  8.2.0686  formatoptions not sufficiently tested
  5248  8.2.0687  some tests do not work on FreeBSD
  2726  8.2.0688  output clobbered if setting 'verbose' to see shell commands
  2291  8.2.0689  when using getaddrinfo() the error message is unclear
  3405  8.2.0690  line number of option set by modeline is wrong
  2021  8.2.0691  startup test fails
  1997  8.2.0692  startup test fails on MS-Windows
  6133  8.2.0693  closure using argument not tested
  7899  8.2.0694  Haiku: channel and terminal do not work
 16197  8.2.0695  Vim9: cannot define a function inside a function
  5946  8.2.0696  Vim9: nested function does not work properly
  3023  8.2.0697  Vim9: memory leak when using nested function
  7906  8.2.0698  insert mode completion not fully tested
  9168  8.2.0699  Vim9: not all errors tested
  2651  8.2.0700  Vim9: converting error message to exception not tested
  2076  8.2.0701  Vim9 test fails without job feature
  1516  8.2.0702  running channel tests may leave running process behind
  9195  8.2.0703  Vim9: closure cannot store value in outer context
  2755  8.2.0704  Vim9: memory leak in disassemble test
  1829  8.2.0705  indent tests don't run on CI for FreeBSD
  3192  8.2.0706  Vim9: using assert_fails() causes function to finish
  1595  8.2.0707  Vim9 function test fails
 24586  8.2.0708  Vim9: constant expressions are not simplified
  1509  8.2.0709  MS-Windows: compiler warning for int vs size_t
  1547  8.2.0710  Netbeans test sometimes fails
  6638  8.2.0711  temp directory might be cleared
  5231  8.2.0712  various code not fully tested
  2152  8.2.0713  the pam_environment file is not recognized
 13770  8.2.0714  Vim9: handling constant expression does not scale
  1430  8.2.0715  Vim9: leaking memory
  2728  8.2.0716  Vim9: another memory leak
 20204  8.2.0717  Vim9: postponed constant expressions does not scale
  1654  8.2.0718  gcc warning for returning pointer to local variable
 45696  8.2.0719  Vim9: more expressions can be evaluated at compile time
  2159  8.2.0720  occasional exit when encountering an X error
  1746  8.2.0721  Vim9: leaking memory when skipping
 12869  8.2.0722  Vim9: not handling constant expression for elseif
  5203  8.2.0723  Vim9: nested constant expression not evaluated compile time
  1984  8.2.0724  Vim9: appending to buffer/window/tab variable not tested
 19244  8.2.0725  Vim9: cannot call a function declared later in Vim9 script
  2374  8.2.0726  Vim9: leaking memory when calling not compiled :def function
  1969  8.2.0727  MS-Windows: new gcc compiler does not support scanf format
  2972  8.2.0728  messages about a deadly signal are not left aligned
  6005  8.2.0729  Vim9: When reloading a script variables are not cleared
 32353  8.2.0730  Vim9: Assignment to dict member does not work
  2208  8.2.0731  Vim9: parsing declarations continues after :finish
  2247  8.2.0732  Vim9: storing value in dict messes up stack
  5593  8.2.0733  Vim9: assigning to dict or list argument does not work
  1751  8.2.0734  Vim9: leaking memory when using :finish
  1997  8.2.0735  Vim9: using unitialized memory
  2755  8.2.0736  some files not recognized as pamenv
  3643  8.2.0737  when shell doesn't support CTRL-Z Vim still handles it
 22852  8.2.0738  mouse handling in a terminal window not well tested
  4785  8.2.0739  incomplete profiling when exiting because of a deadly signal
 11953  8.2.0740  minor message mistakes
 51488  8.2.0741  Python tests fail because of changed message
  2914  8.2.0742  handling of a TERM signal not tested
  2639  8.2.0743  can move to another buffer from a terminal in popup window
  1921  8.2.0744  the name vim is not capitalized in a message
  2463  8.2.0745  crash on exit when not all popups are closed
  4684  8.2.0746  popup_clear() hangs when a popup can't be closed
 14071  8.2.0747  cannot forcefully close all popups
  7749  8.2.0748  cannot get a list of all popups
  1733  8.2.0749  TERM signal test fails on FreeBSD
  2593  8.2.0750  netbeans test is a bit flaky
 26178  8.2.0751  Vim9: performance can be improved
  2170  8.2.0752  terminal in popup window test is a bit flaky
 45540  8.2.0753  Vim9: expressions are evaluated in the discovery phase
  1981  8.2.0754  Vim9: No test for forward declaration
  5297  8.2.0755  Vim9: No error when variable initializer is not a constant
  1878  8.2.0756  MS-Windows: still a compiler warning
 11771  8.2.0757  Vim9: no test for MEMBER instruction
 22918  8.2.0758  Vim9: no test for STORELIST and STOREDICT
 10549  8.2.0759  Vim9: missing changes for performance improvements
  2814  8.2.0760  Vim9: dict member errors not tested
  5874  8.2.0761  Vim9: instructions not tested
  2383  8.2.0762  buffer is not considered modified after setting crypt key
  1560  8.2.0763  GUI test fails without the terminal feature
  4025  8.2.0764  Vim9: assigning to option not fully tested
 12233  8.2.0765  In the GUI can't use all the modifiers.
  3288  8.2.0766  display error when using 'number' and 'breakindent'
  1703  8.2.0767  modifyOtherKeys active when using a shell command in autocmd
  1807  8.2.0768  Vim9: memory leak in script test
  3319  8.2.0769  VimLeavePre not triggered when Vim is terminated
  3111  8.2.0770  cannot map CTRL-B when using the GUI
  8140  8.2.0771  Vim9: cannot call a compiled closure from not compiled code
  2557  8.2.0772  Vim9: some variable initializations not tested
  5532  8.2.0773  switching to raw mode every time ":" is used
 12623  8.2.0774  t_TI and t_TE are output when using 'visualbell'
 12686  8.2.0775  not easy to call a Vim function from Lua
  6976  8.2.0776  libvterm code lags behind the upstream version
  2194  8.2.0777  terminal test fails
  8259  8.2.0778  libvterm code lags behind the upstream version
  2165  8.2.0779  tmode_T not used everywhere
 45046  8.2.0780  libvterm code lags behind the upstream version
  1521  8.2.0781  compiler warning for not using value in Lua
  2280  8.2.0782  cannot build with Lua on MS-Windows
 11605  8.2.0783  libvterm code lags behind the upstream version
 10344  8.2.0784  libvterm code lags behind the upstream version
  9349  8.2.0785  libvterm code lags behind the upstream version
  2347  8.2.0786  channel test is flaky on FreeBSD
 17610  8.2.0787  libvterm code lags behind the upstream version
  1783  8.2.0788  memory leak in libvterm
  3855  8.2.0789  Vim9: expression testing lost coverage using constants
  3754  8.2.0790  Vim9: list index not well tested
 10932  8.2.0791  a second popup window with terminal causes trouble
  1372  8.2.0792  build failure with small features
  2126  8.2.0793  MS-Windows: cannot build GUI with small features
 15805  8.2.0794  libvterm code lags behind the upstream version
 24008  8.2.0795  libvterm code lags behind the upstream version
  1666  8.2.0796  MS-Windows: compiler can't handle C99 construct in libvterm
  1528  8.2.0797  MS-Windows: compiler still can't handle C99 construct
 49936  8.2.0798  libvterm code lags behind the upstream version
  2786  8.2.0799  build fails if snprintf is not available
  8176  8.2.0800  errors from failing test are unclear
  3436  8.2.0801  terminal test fails on Mac
 17507  8.2.0802  libvterm code lags behind the upstream version
 11236  8.2.0803  libvterm code lags behind the upstream version
 45937  8.2.0804  libvterm code lags behind the upstream version
  4075  8.2.0805  terminal key codes test fails on some systems
  2606  8.2.0806  using "func!" after vim9script gives confusing error
 17954  8.2.0807  cannot easily restore a mapping
 10568  8.2.0808  not enough testing for the terminal window
  3157  8.2.0809  build failure with small features
  2405  8.2.0810  error when appending "tagfile" to 'wildoptions'
  3307  8.2.0811  terminal keycode test is flaky
  4832  8.2.0812  mapset() does not properly handle <> notation
 53461  8.2.0813  libvterm code is slightly different from upstream
  1720  8.2.0814  clang warning for implicit conversion
 14439  8.2.0815  maparg() does not provide enough information for mapset()
  7064  8.2.0816  terminal test fails when compiled with Athena
  3249  8.2.0817  not enough memory allocated when converting string
 59063  8.2.0818  Vim9: using a discovery phase doesn't work well
  1370  8.2.0819  compiler warning for unused variable
  9497  8.2.0820  Vim9: function type isn't set until compiled
  2338  8.2.0821  Vim9: memory leak in expr test
  8319  8.2.0822  Vim9: code left over from discovery phase
 18661  8.2.0823  Vim9: script reload test is disabled
  2473  8.2.0824  still not enough memory allocated when converting string
  1699  8.2.0825  def_function() may return pointer that was freed
  2120  8.2.0826  Vim9: crash in :defcompile
  1312  8.2.0827  Vim9: crash in :defcompile
  5047  8.2.0828  Travis: regexp patttern doesn't work everywhere
  2599  8.2.0829  filter() may give misleading error message
  1534  8.2.0830  Motif: can't map "!"
  2580  8.2.0831  compiler warnings for integer sizes
  1655  8.2.0832  compiler warning for uninitialized variable
  1445  8.2.0833  mapping <C-bslash> doesn't work in the GUI
  2125  8.2.0834  :drop command in terminal popup causes problems
  2640  8.2.0835  Motif: mapping <C-bslash> still doesn't work
  4806  8.2.0836  not all :cdo output is visible
  1895  8.2.0837  compiler warning for value set but not used
  1606  8.2.0838  MS-Windows: compiler warning for uninitialized variables
  8408  8.2.0839  dropping modifier when putting a character back in typeahead
  3566  8.2.0840  search match count wrong when only match is in fold
  2831  8.2.0841  'verbose' value 16 causes duplicate output
  1934  8.2.0842  MS-Windows: channel tests fail
  2014  8.2.0843  filetype elm not detected
 18669  8.2.0844  text properties crossing lines not handled correctly
 28991  8.2.0845  text properties crossing lines not handled correctly
  1465  8.2.0846  build failure with small features
 91017  8.2.0847  typval related code is spread out
  8172  8.2.0848  MS-Windows: the Windows terminal code has some flaws
 34051  8.2.0849  BeOS code is not maintained and probably unused
 13165  8.2.0850  MS-Windows: exepath() works different from cmd.exe
  6500  8.2.0851  can't distinguish <M-a> from accented "a" in the GUI
  1612  8.2.0852  cannot map CTRL-S on some systems
 24753  8.2.0853  ml_delete() often called with FALSE argument
  6194  8.2.0854  xxd cannot show offset as a decimal number
 16418  8.2.0855  GUI tests fail because the test doesn't use a modifier
  1961  8.2.0856  CTRL-S stops output
  1936  8.2.0857  GTK cell height can be a pixel too much
  8358  8.2.0858  not easy to require Lua modules
 56215  8.2.0859  no Turkish translation of the manual
 12163  8.2.0860  cannot use CTRL-A and CTRL-X on unsigned numbers
  8533  8.2.0861  cannot easily get all the current marks
  3882  8.2.0862  ":term ++curwin" makes the current buffer hidden
 23695  8.2.0863  cannot set a separate color for underline/undercurl
  5138  8.2.0864  pragmas are indented all the way to the left
 12288  8.2.0865  syntax foldlevel is taken from the start of the line
 20512  8.2.0866  not enough tests for buffer writing
  9504  8.2.0867  using \{xxx} for encoding a modifier is not nice
  8505  8.2.0868  trim() always trims both ends
 28185  8.2.0869  it is not possible to customize the quickfix window contents
  1618  8.2.0870  MS-Windows: Control keys don't work in the GUI
  4817  8.2.0871  cannot use getmarklist() as a method
107599  8.2.0872  XIM code is mixed with multi-byte code
  3006  8.2.0873  a .jl file can be sawfish (lisp) or Julia
  2245  8.2.0874  signals test is a bit flaky
 30776  8.2.0875  getting attributes for directory entries is slow
  4533  8.2.0876  :pwd does not give a hint about the scope of the directory
 28460  8.2.0877  cannot get the search statistics
  9371  8.2.0878  no reduce() function
  1494  8.2.0879  compiler warning for unused function argument
  1490  8.2.0880  leaking memory when using searchcount()
  1519  8.2.0881  compiler warning for argument type
  4060  8.2.0882  leaking memory when using reduce()
  1368  8.2.0883  memory leak in test 49
  4146  8.2.0884  searchcount() test fails on slower systems
  1858  8.2.0885  "make shadow" does not link new lua test dir
 10544  8.2.0886  cannot use octal numbers in scriptversion 4
  2538  8.2.0887  searchcount().exact_match is 1 right after a match
  2852  8.2.0888  readdirex() returns size -2 for a directory
  6358  8.2.0889  using old style comments
  1875  8.2.0890  no color in terminal window when 'termguicolor' is set
  1622  8.2.0891  clang warns for invalid conversion
  2844  8.2.0892  ubsan warns for undefined behavior
  6245  8.2.0893  assert_equalfile() does not take a third argument
  8979  8.2.0894  :mkspell can take very long if the word count is high
 10810  8.2.0895  :mkspell output does not mention the tree type
  2969  8.2.0896  crash when calling searchcount() with a string
 24142  8.2.0897  list of functions in patched version is outdated
  5020  8.2.0898  missing help for a function goes unnoticed
  4693  8.2.0899  assert_equalfile() does not give a hint about the difference
  2332  8.2.0900  function list test fails on MS-Windows
 17280  8.2.0901  formatting CJK text isn't optimal
  4270  8.2.0902  using searchcount() in 'statusline' causes an error
  1723  8.2.0903  comparing WINVER does not work correctly
  2538  8.2.0904  assuming modifyOtherKeys for rhs of mapping
  2693  8.2.0905  test coverage could be better
  2776  8.2.0906  when setting 'termguicolors' SpellBad is no longer red
  2499  8.2.0907  when using :global clipboard isn't set correctly
  5365  8.2.0908  crash when changing the function table while listing it
  9916  8.2.0909  cannot go back to the previous local directory
  5851  8.2.0910  Vim is not reproducibly buildable
  4609  8.2.0911  crash when opening a buffer for the cmdline window fails
  6066  8.2.0912  a few test cases for CJK formatting are disabled
  3930  8.2.0913  code for resetting v:register is duplicated
  3014  8.2.0914  MS-Windows: cannot specify a "modified by" text
 15395  8.2.0915  search() cannot skip over matches like searchpair() can
  8585  8.2.0916  mapping with partly modifyOtherKeys code does not work
  6548  8.2.0917  quickfix entries do not suport a "note" type
 12276  8.2.0918  duplicate code for evaluating expression argument
  4792  8.2.0919  merging modifier for modifyOtherKeys is done twice
  3619  8.2.0920  writing viminfo fails with a circular reference
  3236  8.2.0921  CTRL-W T in cmdline window causes trouble
  2948  8.2.0922  search test fails
  2397  8.2.0923  cmdline test is slow
 15421  8.2.0924  cannot save and restore a register properly
  7806  8.2.0925  getcompletion() does not return command line arguments
  4669  8.2.0926  cmdline test fails on Appveyor
  3048  8.2.0927  some sshconfig and ssdhconfig files are not recognized
 11902  8.2.0928  many type casts are used for vim_strnsave()
  4019  8.2.0929  v:register is not cleared after an operator was executed
  4286  8.2.0930  script filetype detection trips over env -S argument
 20145  8.2.0931  some remarks about BeOS remain
  3293  8.2.0932  missspelling spelllang
  7490  8.2.0933  'quickfixtextfunc' does not get window ID of location list
  2862  8.2.0934  lhelpgrep twice in help window doesn't jump to the help topic 
 11514  8.2.0935  flattening a list with existing code is slow
 17977  8.2.0936  some terminals misinterpret the code for getting cursor style
  1756  8.2.0937  asan failure in the flatten() test
  6310  8.2.0938  NFA regexp uses tolower ()to compare ignore-case
 38367  8.2.0939  checking for term escape sequences is long and confusing
  2307  8.2.0940  build failure with tiny features
 17772  8.2.0941  detecting terminal properties is unstructured
  2971  8.2.0942  expanding to local dir after homedir keeps "~/"
 12489  8.2.0943  displaying ^M or ^J depends on current buffer
  1452  8.2.0944  xxd test leaves file behind
 10205  8.2.0945  cannot use "z=" when 'spell' is off
  3433  8.2.0946  cannot use "q" to cancel a number prompt
  3712  8.2.0947  readdirex() doesn't handle broken link properly
  3193  8.2.0948  spell test fails
  1974  8.2.0949  strptime() does not use DST
  1569  8.2.0950  tagjump test fails
  1536  8.2.0951  search stat test has leftover from debugging
  8396  8.2.0952  no simple way to interrupt Vim
  7919  8.2.0953  spell checking doesn't work for CamelCased words
  2708  8.2.0954  not all desktop files are recognized
  1487  8.2.0955  build fails
  2756  8.2.0956  spell test fails
  1565  8.2.0957  compiler warning for uninitialized variable
  3956  8.2.0958  not sufficient testing for buffer writing
 12626  8.2.0959  using 'quickfixtextfunc' is a bit slow
  7325  8.2.0960  cannot use :import in legacy Vim script
 11668  8.2.0961  MS-Windows: no completion for locales
  1867  8.2.0962  terminal test sometimes hangs on Travis
  5286  8.2.0963  number increment/decrement does not work with 'virtualedit'
  4065  8.2.0964  TextYankPost does not provide info about Visual selection
  2009  8.2.0965  has_funcundefined() is not used
  5065  8.2.0966  'shortmess' flag "n" not used in two places
 31028  8.2.0967  unnecessary type casts for vim_strnsave()
 21225  8.2.0968  no proper testing of the 'cpoptions' flags
  5788  8.2.0969  assert_equal() output for dicts is hard to figure out
 16829  8.2.0970  terminal properties are not available in Vim script
  1982  8.2.0971  build with tiny features fails
  6550  8.2.0972  Vim9 script variable declarations need a type
  6075  8.2.0973  Vim9: type is not checked when assigning to a script variable
  1410  8.2.0974  Vim9: memory leak when script var has wrong type
  3185  8.2.0975  Vim9: script variable does not accept optional s: prefix
 15334  8.2.0976  some 'cpoptions' not tested
  4167  8.2.0977  t_8u is made empty for the wrong terminals
  1815  8.2.0978  leaking memory in termcodes test
  2136  8.2.0979  a couple of screendump tests fail
  2410  8.2.0980  raku file extension not recognized
 47932  8.2.0981  Vim9: cannot compile "[var, var] = list"
 10734  8.2.0982  insufficient testing for reading/writing files
  2723  8.2.0983  SConstruct file type not recognized
  3515  8.2.0984  not using previous window when closing a shell popup window
  3603  8.2.0985  simplify() does not remove slashes from "///path"
  2080  8.2.0986  MS-Windows: functions test fails
 11962  8.2.0987  Vim9: cannot assign to [var; var]
 32430  8.2.0988  getting directory contents is always case sorted
  2771  8.2.0989  crash after resizing a terminal window
  2806  8.2.0990  Using duplicate error number
  3947  8.2.0991  cannot get window type for autocmd and preview window
  5662  8.2.0992  Vim9: crash when using :import in the Vim command
  2373  8.2.0993  Vim9 script test fails with normal features
  2491  8.2.0994  Vim9: missing function causes compilation error
  2023  8.2.0995  insufficient testing for the readdir() sort option
  3015  8.2.0996  using "aucmdwin" in win_gettype() is not ideal
  7462  8.2.0997  cannot execute a register containing line continuation
  3483  8.2.0998  not all tag code is tested
  2854  8.2.0999  moving to next sentence gets stuck on quote
  2829  8.2.1000  get error when leaving Ex mode with :visual
  5742  8.2.1001  Vim9: crash with nested "if" and assignment
  1962  8.2.1002  test may fail when run directly
  2911  8.2.1003  Vim9: return type of sort() is too generic
  8721  8.2.1004  line numbers below filler lines not always updated
 12329  8.2.1005  Vim9: using TRUE/FALSE/MAYBE for ctx_skip is confusing
 13113  8.2.1006  Vim9: require unnecessary return statement
  2375  8.2.1007  completion doesn't work after ":r ++arg !"
  2500  8.2.1008  Vim9: no test for disassambling newly added instructions
  2962  8.2.1009  Vim9: some failures not checked for
  1797  8.2.1010  build failure in libvterm with debug enabled
  6981  8.2.1011  Vim9: some code not tested
  3799  8.2.1012  Vim9: cannot declare single character script variables
  4206  8.2.1013  channel tests can be a bit flaky
  5436  8.2.1014  using "name" for a string result is confusing
  4692  8.2.1015  popup filter gets key with modifier prepended
  1580  8.2.1016  Vim9: test fails when channel feature is missing
  2995  8.2.1017  Appveyor output doesn't show MinGW console features
  4809  8.2.1018  typo in enum value
  5291  8.2.1019  mapping <M-S-a> does not work in the GUI
  1677  8.2.1020  popupwin test fails in the GUI
  2351  8.2.1021  Ruby interface not tested enough
 20586  8.2.1022  various parts of code not covered by tests
 18651  8.2.1023  Vim9: redefining a function uses a new index every time
  7542  8.2.1024  Vim9: no error for using "let g:var = val"
  4908  8.2.1025  tabpage menu and tabline not sufficiently tested
  4588  8.2.1026  Vim9: cannot break the line after "->"
  2987  8.2.1027  GUI: multi-byte characters do not work in a terminal
 10721  8.2.1028  Vim9: no error for declaring buffer, window, etc. variable
  9641  8.2.1029  Vim9: cannot chain function calls with -> at line start
  3465  8.2.1030  reducing size of a terminal window may cause a crash
  2247  8.2.1031  build failure with Perl5.32
  3173  8.2.1032  error message for declaring a variable cannot be translated
  2292  8.2.1033  not easy to read the test time in the test output
  1794  8.2.1034  compiler warning for uninitialized variables
  6278  8.2.1035  setreg() does not always clear the register
  1812  8.2.1036  popupwin test fails sometimes
  2450  8.2.1037  Vim9: crash when using line continuation inside :def
  1836  8.2.1038  popupwin test fails
  2533  8.2.1039  cannot put NUL byte on clipboard
 24906  8.2.1040  not enough testing for movement commands
  2183  8.2.1041  test summary is missing executed count
  9901  8.2.1042  Vim9: cannot put an operator on the next line
  1869  8.2.1043  %a item in 'statusline' not tested
  4508  8.2.1044  not all systemd file types are recognized
 16409  8.2.1045  Vim9: line break before operator does not work
 22866  8.2.1046  insufficient tests for src/buffer.c
 40535  8.2.1047  Vim9: script cannot use line continuation like :def function
  1335  8.2.1048  build failure without the eval feature
 27759  8.2.1049  Vim9: leaking memory when using continuation line
  1813  8.2.1050  missing change in struct
  3030  8.2.1051  crash when changing a list while using reduce() on it
  1599  8.2.1052  build failure with older compilers
  5227  8.2.1053  insufficient testing for 'statusline' and 'tabline'
 12476  8.2.1054  not so easy to pass a lua function to Vim
  3424  8.2.1055  no filetype set for pacman config files
 11397  8.2.1056  wrong display when mixing match conceal and syntax conceal
  2474  8.2.1057  cannot build with dynamic Lua
  3180  8.2.1058  multiline conceal causes display errors
  3814  8.2.1059  crash when using :tabonly in an autocommand
  2596  8.2.1060  not all elinks files are recognized
 13616  8.2.1061  insufficient testing for src/window.c
  3547  8.2.1062  Vim9: no line break allowed inside "cond ? val1 : val2"
  4866  8.2.1063  Vim9: no line break allowed before || or &&
  3141  8.2.1064  Vim9: no line break allowed before comperators
 10632  8.2.1065  Vim9: no line break allowed inside a list
  6312  8.2.1066  Lua arrays are zero based
  9416  8.2.1067  expression "!expr->func()" does not work
  8876  8.2.1068  Vim9: no line break allowed inside a dict
  2091  8.2.1069  Vim9: fail to check for white space in list
  1300  8.2.1070  Vim9: leaking memory when lacking white space in dict
 23612  8.2.1071  Vim9: no line break allowed inside a lambda
  2699  8.2.1072  missing libvterm test
  3000  8.2.1073  Vim9: no line break allowed in () expression
 13479  8.2.1074  Vim9: no line break allowed after some operators
  2114  8.2.1075  Vim9: no line break allowed in :echo expression
  6343  8.2.1076  Vim9: no line break allowed in :if expression
  8949  8.2.1077  not enough test coverage for highlighting
 78177  8.2.1078  highlight and match functionality together in one file
 14404  8.2.1079  Vim9: no line break allowed in a while loop
 12853  8.2.1080  Vim9: no line break allowed in a for loop
  5407  8.2.1081  Lua: cannot use table.insert() and table.remove()
  2671  8.2.1082  Coverity complains about ignoring dict_add() return value
  3443  8.2.1083  crash when using reduce() on a NULL list
  2537  8.2.1084  Lua: registering function has useless code
  2681  8.2.1085  Coverity complains about ignoring dict_add() return value
  3544  8.2.1086  possibly using freed memory when text properties used
  1706  8.2.1087  possible memory leak when file expansion fails
  2399  8.2.1088  a very long translation might cause a buffer overflow
  2258  8.2.1089  Coverity warns for pointer computation
  1638  8.2.1090  may use NULL pointer when skipping over name
  1644  8.2.1091  no check if opening a pty works
  1579  8.2.1092  not checking if saving for undo succeeds
  1357  8.2.1093  Python: double free when adding item to dict fails
  1532  8.2.1094  dead code in libvterm
  2213  8.2.1095  may use pointer after freeing it
  4325  8.2.1096  Vim9: return type of getqflist() is wrong
  3600  8.2.1097  highlight code not sufficiently tested
  2715  8.2.1098  Vim9: cannot use line break in :throw argument
  4746  8.2.1099  Vim9: cannot use line break in :cexpr argument
  4995  8.2.1100  Vim9: cannot use line break in :execute argument
  2233  8.2.1101  no error when using wrong arguments for setqflist()
  3604  8.2.1102  Coverity gets confused by an unnecessary NULL check
  1580  8.2.1103  Coverity reports an unnecessary NULL check
  1870  8.2.1104  Coverity warns for possible NULL pointer use
 14908  8.2.1105  insufficient test coverage for Lua
  2975  8.2.1106  crash when trying to use s: variable in typed command
  4059  8.2.1107  'imactivatefunc' and 'imstatusfunc' are not used in the GUI
 12157  8.2.1108  mouse left-right scroll is not supported in terminal window
  1841  8.2.1109  still crashing when using s:variable
 17701  8.2.1110  Vim9: line continuation does not work in function arguments
 23963  8.2.1111  inconsistent naming of get_list_tv() and eval_dict()
  6713  8.2.1112  Vim9: no line continuation allowed in method call
  1740  8.2.1113  no test for verbose output of :call
104121  8.2.1114  terminal test sometimes times out
  2040  8.2.1115  iminsert test fails when compiled with VIMDLL
  3781  8.2.1116  Vim9: parsing command checks for list twice
  1302  8.2.1117  Coverity warns for unsing unitialized field
  1414  8.2.1118  condition can never be true, dead code
  2579  8.2.1119  configure fails with Xcode 12 beta
267473  8.2.1120  Python code not tested properly
  2938  8.2.1121  command completion not working after ++arg
  5106  8.2.1122  Vim9: line continuation in dict member not recognized
305297  8.2.1123  Python 3 test is old style
 17742  8.2.1124  Vim9: no line break allowed in :import command
  7493  8.2.1125  Vim9: double quote can be a string or a comment
  1904  8.2.1126  Vim9: using :copen causes an error
  2602  8.2.1127  Vim9: getting a dict member may not work
  7767  8.2.1128  the write message mentions characters, but it's bytes
  4364  8.2.1129  Vim9: bar not recognized after not compiled command
  2137  8.2.1130  Vim9: bar not recognized after function call
  4115  8.2.1131  Vim9: error message for returning a value is not clear
  3173  8.2.1132  Vim9: return type of repeat() is not specific enough
  2509  8.2.1133  Vim9: return type of add() is not specific enough
  2531  8.2.1134  Vim9: getting a list member may not work
  2870  8.2.1135  Vim9: getting a dict member may not work
  3029  8.2.1136  Vim9: return type of argv() is always any
  6981  8.2.1137  Vim9: modifiers not cleared after compiling function
  3693  8.2.1138  Vim9: return type of copy() and deepcopy() is any
  2546  8.2.1139  Vim9: test for silent echo fails in some environments
  2564  8.2.1140  Vim9: return type of extend() is any
  2837  8.2.1141  Vim9: return type of filter() is any
  2771  8.2.1142  Vim9: return type of insert() is any
  3508  8.2.1143  Vim9: return type of remove() is any
  2523  8.2.1144  Vim9: return type of reverse() is any
  4982  8.2.1145  Vim9: "for" only accepts a list at compile time
 48005  8.2.1146  not enough testing for Python
  9434  8.2.1147  :confirm may happen in cooked mode
  3160  8.2.1148  warning for using int instead of size_t
  3396  8.2.1149  Vim9: :eval command not handled properly
  6243  8.2.1150  ml_get error when using Python
  6275  8.2.1151  insufficient test coverage for Python
  2924  8.2.1152  Vim9: function reference is missing script prefix
  1811  8.2.1153  Vim9: script test fails on some systems
  9394  8.2.1154  Vim9: crash when using imported function
 17167  8.2.1155  Vim9: cannot handle line break inside lambda
  2305  8.2.1156  Vim9: No error for invalid command in compiled function
  2883  8.2.1157  Vim9: dict.name is not recognized as an expression
  1525  8.2.1158  build error
  3080  8.2.1159  Vim9: no error for missing space after a comma
  3173  8.2.1160  Vim9: memory leak in allocated types
 12231  8.2.1161  Vim9: using freed memory
  1915  8.2.1162  crash when using a lambda
  1531  8.2.1163  build error
  2644  8.2.1164  text cleared by checking terminal properties not redrawn
  6407  8.2.1165  insufficient testing for the Tcl interface
  3171  8.2.1166  once mouse move events are enabled getchar() returns them
 10210  8.2.1167  Vim9: builtin function method call only supports first arg
  2051  8.2.1168  wrong method argument for appendbufline()

Icon  Name                    Last modified      Size  
[DIR] Parent Directory - [TXT] 8.2.0001 13-Dec-2019 18:27 1.5K [   ] 8.2.0002 13-Dec-2019 19:37 2.4K [TXT] 8.2.0003 14-Dec-2019 16:19 16K [TXT] 8.2.0004 14-Dec-2019 16:19 16K [TXT] 8.2.0005 14-Dec-2019 17:26 4.0K [TXT] 8.2.0006 14-Dec-2019 17:56 1.8K [TXT] 8.2.0007 14-Dec-2019 19:27 4.6K [   ] 8.2.0008 14-Dec-2019 20:35 11K [   ] 8.2.0009 15-Dec-2019 12:55 3.9K [   ] 8.2.0010 15-Dec-2019 13:40 86K [TXT] 8.2.0011 15-Dec-2019 14:56 5.0K [   ] 8.2.0012 15-Dec-2019 18:10 3.3K [TXT] 8.2.0013 16-Dec-2019 17:11 17K [   ] 8.2.0014 16-Dec-2019 22:44 27K [   ] 8.2.0015 17-Dec-2019 20:36 4.6K [   ] 8.2.0016 17-Dec-2019 20:36 1.7K [   ] 8.2.0017 17-Dec-2019 21:28 48K [   ] 8.2.0018 17-Dec-2019 22:11 2.6K [   ] 8.2.0019 17-Dec-2019 22:41 2.9K [TXT] 8.2.0020 18-Dec-2019 19:37 15K [TXT] 8.2.0021 18-Dec-2019 20:11 3.4K [TXT] 8.2.0022 18-Dec-2019 21:34 2.0K [   ] 8.2.0023 18-Dec-2019 22:27 8.2K [   ] 8.2.0024 19-Dec-2019 16:03 2.1K [TXT] 8.2.0025 20-Dec-2019 19:23 1.7K [TXT] 8.2.0026 21-Dec-2019 18:26 285K [TXT] 8.2.0027 21-Dec-2019 18:48 21K [   ] 8.2.0028 21-Dec-2019 22:01 9.6K [   ] 8.2.0029 21-Dec-2019 22:23 3.2K [TXT] 8.2.0030 22-Dec-2019 15:38 3.9K [   ] 8.2.0031 22-Dec-2019 16:10 2.5K [   ] 8.2.0032 22-Dec-2019 18:30 2.8K [   ] 8.2.0033 22-Dec-2019 19:41 1.8K [   ] 8.2.0034 23-Dec-2019 18:20 1.8K [TXT] 8.2.0035 23-Dec-2019 23:00 18K [   ] 8.2.0036 24-Dec-2019 15:18 3.1K [TXT] 8.2.0037 24-Dec-2019 15:44 1.4K [   ] 8.2.0038 25-Dec-2019 13:38 7.6K [TXT] 8.2.0039 25-Dec-2019 13:56 2.6K [   ] 8.2.0040 25-Dec-2019 14:00 1.7K [TXT] 8.2.0041 25-Dec-2019 14:14 2.3K [   ] 8.2.0042 25-Dec-2019 15:13 1.9K [   ] 8.2.0043 25-Dec-2019 15:47 1.8K [TXT] 8.2.0044 25-Dec-2019 18:15 16K [   ] 8.2.0045 25-Dec-2019 19:34 5.2K [   ] 8.2.0046 27-Dec-2019 13:50 9.3K [TXT] 8.2.0047 27-Dec-2019 13:50 6.8K [   ] 8.2.0048 27-Dec-2019 17:16 1.8K [TXT] 8.2.0049 27-Dec-2019 17:21 6.5K [TXT] 8.2.0050 27-Dec-2019 17:34 3.7K [   ] 8.2.0051 28-Dec-2019 14:07 1.9K [   ] 8.2.0052 28-Dec-2019 17:11 5.8K [TXT] 8.2.0053 29-Dec-2019 13:44 2.4K [   ] 8.2.0054 29-Dec-2019 13:57 6.5K [TXT] 8.2.0055 29-Dec-2019 15:21 2.3K [   ] 8.2.0056 29-Dec-2019 23:05 61K [TXT] 8.2.0057 29-Dec-2019 23:54 2.6K [TXT] 8.2.0058 30-Dec-2019 00:09 1.8K [TXT] 8.2.0059 30-Dec-2019 10:59 1.7K [TXT] 8.2.0060 30-Dec-2019 17:58 2.3K [TXT] 8.2.0061 30-Dec-2019 19:21 1.9K [TXT] 8.2.0062 30-Dec-2019 20:00 1.6K [TXT] 8.2.0063 30-Dec-2019 20:43 1.7K [   ] 8.2.0064 30-Dec-2019 22:00 6.2K [TXT] 8.2.0065 30-Dec-2019 22:34 3.9K [TXT] 8.2.0066 31-Dec-2019 19:29 7.5K [TXT] 8.2.0067 31-Dec-2019 21:28 11K [   ] 8.2.0068 31-Dec-2019 22:00 2.1K [TXT] 8.2.0069 31-Dec-2019 22:37 15K [   ] 8.2.0070 01-Jan-2020 15:05 2.1K [TXT] 8.2.0071 01-Jan-2020 15:18 2.5K [TXT] 8.2.0072 01-Jan-2020 15:27 1.6K [TXT] 8.2.0073 01-Jan-2020 15:47 5.3K [TXT] 8.2.0074 01-Jan-2020 17:10 4.0K [TXT] 8.2.0075 01-Jan-2020 17:10 1.7K [   ] 8.2.0076 01-Jan-2020 17:45 1.7K [TXT] 8.2.0077 02-Jan-2020 14:02 6.4K [TXT] 8.2.0078 02-Jan-2020 14:32 2.7K [   ] 8.2.0079 02-Jan-2020 22:58 1.5K [TXT] 8.2.0080 02-Jan-2020 22:58 3.9K [TXT] 8.2.0081 03-Jan-2020 19:13 2.0K [   ] 8.2.0082 03-Jan-2020 21:00 2.4K [   ] 8.2.0083 03-Jan-2020 21:26 4.1K [   ] 8.2.0084 04-Jan-2020 14:34 19K [TXT] 8.2.0085 04-Jan-2020 16:14 3.8K [TXT] 8.2.0086 04-Jan-2020 19:01 2.7K [   ] 8.2.0087 05-Jan-2020 14:43 4.2K [TXT] 8.2.0088 05-Jan-2020 21:52 16K [   ] 8.2.0089 05-Jan-2020 22:07 1.9K [TXT] 8.2.0090 05-Jan-2020 22:11 1.6K [TXT] 8.2.0091 06-Jan-2020 19:59 1.8K [   ] 8.2.0092 06-Jan-2020 21:04 8.1K [TXT] 8.2.0093 06-Jan-2020 21:04 2.2K [TXT] 8.2.0094 06-Jan-2020 21:23 1.5K [TXT] 8.2.0095 06-Jan-2020 21:48 4.4K [   ] 8.2.0096 06-Jan-2020 23:09 13K [   ] 8.2.0097 07-Jan-2020 20:12 2.8K [   ] 8.2.0098 07-Jan-2020 21:00 9.2K [   ] 8.2.0099 07-Jan-2020 21:12 2.3K [TXT] 8.2.0100 07-Jan-2020 21:33 33K [   ] 8.2.0101 08-Jan-2020 18:57 2.3K [   ] 8.2.0102 08-Jan-2020 19:28 1.6K [   ] 8.2.0103 08-Jan-2020 19:32 3.8K [   ] 8.2.0104 08-Jan-2020 20:09 2.5K [TXT] 8.2.0105 08-Jan-2020 21:43 6.5K [   ] 8.2.0106 09-Jan-2020 16:32 8.6K [TXT] 8.2.0107 09-Jan-2020 16:32 1.6K [   ] 8.2.0108 09-Jan-2020 21:03 5.0K [TXT] 8.2.0109 09-Jan-2020 21:36 5.4K [   ] 8.2.0110 10-Jan-2020 19:57 16K [   ] 8.2.0111 11-Jan-2020 16:06 22K [TXT] 8.2.0112 12-Jan-2020 13:54 2.2K [   ] 8.2.0113 12-Jan-2020 15:47 3.8K [TXT] 8.2.0114 12-Jan-2020 17:43 9.7K [TXT] 8.2.0115 13-Jan-2020 20:41 5.0K [TXT] 8.2.0116 13-Jan-2020 20:55 4.6K [   ] 8.2.0117 14-Jan-2020 19:06 2.3K [   ] 8.2.0118 14-Jan-2020 20:43 5.4K [   ] 8.2.0119 14-Jan-2020 22:03 1.8K [TXT] 8.2.0120 15-Jan-2020 20:38 4.1K [TXT] 8.2.0121 15-Jan-2020 20:52 4.2K [TXT] 8.2.0122 16-Jan-2020 19:41 8.2K [TXT] 8.2.0123 17-Jan-2020 18:59 3.9K [   ] 8.2.0124 17-Jan-2020 19:12 1.9K [TXT] 8.2.0125 17-Jan-2020 19:33 6.3K [   ] 8.2.0126 17-Jan-2020 21:01 1.6K [   ] 8.2.0127 18-Jan-2020 15:07 3.1K [   ] 8.2.0128 18-Jan-2020 15:54 12K [TXT] 8.2.0129 18-Jan-2020 16:12 4.4K [   ] 8.2.0130 19-Jan-2020 13:58 2.9K [TXT] 8.2.0131 19-Jan-2020 20:18 4.0K [TXT] 8.2.0132 19-Jan-2020 20:18 3.1K [TXT] 8.2.0133 20-Jan-2020 20:34 2.4K [   ] 8.2.0134 20-Jan-2020 20:42 4.3K [TXT] 8.2.0135 20-Jan-2020 21:13 2.2K [TXT] 8.2.0136 20-Jan-2020 21:33 1.8K [TXT] 8.2.0137 20-Jan-2020 21:45 3.2K [TXT] 8.2.0138 20-Jan-2020 22:00 2.2K [TXT] 8.2.0139 20-Jan-2020 22:06 2.0K [TXT] 8.2.0140 21-Jan-2020 22:14 9.7K [   ] 8.2.0141 22-Jan-2020 22:11 2.6K [   ] 8.2.0142 23-Jan-2020 15:34 5.4K [   ] 8.2.0143 23-Jan-2020 15:49 1.7K [   ] 8.2.0144 23-Jan-2020 16:20 13K [   ] 8.2.0145 23-Jan-2020 16:52 2.7K [   ] 8.2.0146 23-Jan-2020 20:01 3.2K [   ] 8.2.0147 23-Jan-2020 20:58 4.7K [TXT] 8.2.0148 24-Jan-2020 20:22 7.9K [TXT] 8.2.0149 26-Jan-2020 15:57 534K [TXT] 8.2.0150 26-Jan-2020 16:50 2.9K [TXT] 8.2.0151 26-Jan-2020 17:39 5.8K [TXT] 8.2.0152 26-Jan-2020 18:36 2.3K [   ] 8.2.0153 26-Jan-2020 18:57 2.1K [TXT] 8.2.0154 26-Jan-2020 19:29 21K [TXT] 8.2.0155 26-Jan-2020 21:43 5.6K [TXT] 8.2.0156 26-Jan-2020 22:07 35K [TXT] 8.2.0157 26-Jan-2020 22:07 1.8K [TXT] 8.2.0158 26-Jan-2020 22:44 8.2K [TXT] 8.2.0159 27-Jan-2020 22:11 19K [   ] 8.2.0160 27-Jan-2020 22:38 1.9K [   ] 8.2.0161 27-Jan-2020 22:47 2.6K [TXT] 8.2.0162 27-Jan-2020 23:02 1.7K [   ] 8.2.0163 28-Jan-2020 20:49 2.7K [   ] 8.2.0164 28-Jan-2020 22:31 6.6K [   ] 8.2.0165 28-Jan-2020 22:31 1.5K [   ] 8.2.0166 28-Jan-2020 22:40 1.7K [TXT] 8.2.0167 28-Jan-2020 22:47 2.0K [   ] 8.2.0168 28-Jan-2020 22:53 1.9K [   ] 8.2.0169 28-Jan-2020 23:01 1.5K [TXT] 8.2.0170 28-Jan-2020 23:04 2.4K [TXT] 8.2.0171 28-Jan-2020 23:10 1.5K [TXT] 8.2.0172 28-Jan-2020 23:14 1.9K [TXT] 8.2.0173 29-Jan-2020 21:28 28K [TXT] 8.2.0174 29-Jan-2020 22:00 15K [TXT] 8.2.0175 29-Jan-2020 22:18 2.9K [TXT] 8.2.0176 29-Jan-2020 22:31 1.4K [TXT] 8.2.0177 29-Jan-2020 22:39 1.5K [TXT] 8.2.0178 30-Jan-2020 11:54 4.2K [   ] 8.2.0179 30-Jan-2020 15:01 17K [TXT] 8.2.0180 30-Jan-2020 16:10 1.7K [   ] 8.2.0181 30-Jan-2020 16:28 17K [TXT] 8.2.0182 30-Jan-2020 16:40 2.2K [TXT] 8.2.0183 30-Jan-2020 18:25 59K [TXT] 8.2.0184 30-Jan-2020 19:39 1.6K [TXT] 8.2.0185 31-Jan-2020 20:11 16K [   ] 8.2.0186 31-Jan-2020 21:14 2.3K [   ] 8.2.0187 31-Jan-2020 21:21 1.8K [TXT] 8.2.0188 31-Jan-2020 22:13 8.3K [   ] 8.2.0189 31-Jan-2020 22:42 2.0K [TXT] 8.2.0190 31-Jan-2020 22:59 2.5K [   ] 8.2.0191 01-Feb-2020 22:19 31K [TXT] 8.2.0192 01-Feb-2020 22:19 3.5K [   ] 8.2.0193 01-Feb-2020 22:40 1.9K [   ] 8.2.0194 01-Feb-2020 23:05 11K [TXT] 8.2.0195 02-Feb-2020 13:53 2.8K [TXT] 8.2.0196 02-Feb-2020 15:26 5.2K [   ] 8.2.0197 02-Feb-2020 15:33 10K [   ] 8.2.0198 02-Feb-2020 15:56 3.1K [   ] 8.2.0199 02-Feb-2020 17:23 5.7K [TXT] 8.2.0200 02-Feb-2020 22:25 26K [   ] 8.2.0201 03-Feb-2020 20:51 18K [TXT] 8.2.0202 03-Feb-2020 21:30 1.4K [   ] 8.2.0203 03-Feb-2020 21:40 11K [   ] 8.2.0204 03-Feb-2020 22:16 3.3K [TXT] 8.2.0205 03-Feb-2020 22:59 2.1K [   ] 8.2.0206 04-Feb-2020 21:25 4.1K [TXT] 8.2.0207 04-Feb-2020 21:55 4.6K [TXT] 8.2.0208 04-Feb-2020 22:23 6.8K [   ] 8.2.0209 04-Feb-2020 22:33 4.7K [TXT] 8.2.0210 04-Feb-2020 23:09 1.7K [   ] 8.2.0211 05-Feb-2020 20:12 2.7K [   ] 8.2.0212 05-Feb-2020 20:40 9.9K [TXT] 8.2.0213 05-Feb-2020 20:45 3.4K [   ] 8.2.0214 05-Feb-2020 21:14 4.5K [   ] 8.2.0215 05-Feb-2020 21:14 2.6K [   ] 8.2.0216 05-Feb-2020 22:10 5.2K [   ] 8.2.0217 05-Feb-2020 22:21 1.8K [   ] 8.2.0218 05-Feb-2020 22:56 6.5K [TXT] 8.2.0219 05-Feb-2020 23:02 2.1K [TXT] 8.2.0220 06-Feb-2020 11:55 2.0K [   ] 8.2.0221 06-Feb-2020 13:16 3.2K [TXT] 8.2.0222 06-Feb-2020 17:52 16K [   ] 8.2.0223 06-Feb-2020 19:26 19K [   ] 8.2.0224 06-Feb-2020 20:40 5.5K [   ] 8.2.0225 06-Feb-2020 21:27 4.7K [   ] 8.2.0226 06-Feb-2020 22:07 3.7K [   ] 8.2.0227 06-Feb-2020 22:41 3.8K [TXT] 8.2.0228 07-Feb-2020 20:51 2.8K [   ] 8.2.0229 07-Feb-2020 22:10 12K [   ] 8.2.0230 07-Feb-2020 22:21 1.8K [TXT] 8.2.0231 08-Feb-2020 14:23 1.9K [TXT] 8.2.0232 08-Feb-2020 16:01 2.6K [TXT] 8.2.0233 08-Feb-2020 16:41 13K [   ] 8.2.0234 08-Feb-2020 17:15 2.5K [TXT] 8.2.0235 08-Feb-2020 18:41 2.9K [TXT] 8.2.0236 10-Feb-2020 22:07 1.7K [TXT] 8.2.0237 10-Feb-2020 20:34 2.2K [   ] 8.2.0238 10-Feb-2020 21:33 2.7K [TXT] 8.2.0239 10-Feb-2020 22:07 3.0K [TXT] 8.2.0240 10-Feb-2020 22:45 3.8K [   ] 8.2.0241 10-Feb-2020 22:57 2.0K [   ] 8.2.0242 11-Feb-2020 21:45 2.1K [   ] 8.2.0243 11-Feb-2020 22:04 22K [TXT] 8.2.0244 11-Feb-2020 22:38 1.9K [TXT] 8.2.0245 11-Feb-2020 22:50 1.7K [TXT] 8.2.0246 11-Feb-2020 23:02 5.2K [TXT] 8.2.0247 12-Feb-2020 21:04 1.8K [TXT] 8.2.0248 12-Feb-2020 21:16 5.4K [TXT] 8.2.0249 12-Feb-2020 21:53 2.6K [TXT] 8.2.0250 12-Feb-2020 22:28 7.0K [   ] 8.2.0251 12-Feb-2020 22:28 4.0K [   ] 8.2.0252 13-Feb-2020 20:32 2.0K [   ] 8.2.0253 13-Feb-2020 21:30 3.4K [   ] 8.2.0254 13-Feb-2020 21:43 1.7K [TXT] 8.2.0255 13-Feb-2020 22:03 2.6K [   ] 8.2.0256 14-Feb-2020 13:23 67K [TXT] 8.2.0257 14-Feb-2020 14:33 8.3K [   ] 8.2.0258 14-Feb-2020 16:54 5.9K [TXT] 8.2.0259 15-Feb-2020 00:01 2.9K [TXT] 8.2.0260 15-Feb-2020 23:08 16K [   ] 8.2.0261 16-Feb-2020 13:35 11K [TXT] 8.2.0262 16-Feb-2020 15:05 1.6K [TXT] 8.2.0263 16-Feb-2020 15:05 3.1K [TXT] 8.2.0264 16-Feb-2020 15:10 1.8K [   ] 8.2.0265 16-Feb-2020 16:23 1.9K [TXT] 8.2.0266 16-Feb-2020 17:05 1.4K [   ] 8.2.0267 16-Feb-2020 19:44 2.1K [   ] 8.2.0268 17-Feb-2020 10:02 1.7K [TXT] 8.2.0269 17-Feb-2020 21:12 2.8K [   ] 8.2.0270 17-Feb-2020 21:34 24K [TXT] 8.2.0271 17-Feb-2020 22:13 14K [   ] 8.2.0272 17-Feb-2020 22:40 5.4K [TXT] 8.2.0273 17-Feb-2020 22:54 3.6K [TXT] 8.2.0274 18-Feb-2020 21:33 2.8K [   ] 8.2.0275 18-Feb-2020 21:55 7.9K [TXT] 8.2.0276 19-Feb-2020 12:42 3.4K [   ] 8.2.0277 19-Feb-2020 14:20 4.9K [   ] 8.2.0278 19-Feb-2020 14:32 1.9K [   ] 8.2.0279 19-Feb-2020 15:48 2.1K [   ] 8.2.0280 19-Feb-2020 17:06 2.1K [TXT] 8.2.0281 19-Feb-2020 17:13 4.7K [   ] 8.2.0282 19-Feb-2020 18:15 4.0K [   ] 8.2.0283 19-Feb-2020 20:23 3.6K [TXT] 8.2.0284 19-Feb-2020 21:13 1.5K [TXT] 8.2.0285 19-Feb-2020 22:32 6.6K [TXT] 8.2.0286 20-Feb-2020 20:13 7.2K [TXT] 8.2.0287 20-Feb-2020 20:41 2.9K [TXT] 8.2.0288 20-Feb-2020 22:15 8.0K [TXT] 8.2.0289 20-Feb-2020 22:18 1.4K [   ] 8.2.0290 20-Feb-2020 22:36 2.4K [   ] 8.2.0291 20-Feb-2020 22:55 7.8K [   ] 8.2.0292 20-Feb-2020 23:09 2.2K [   ] 8.2.0293 21-Feb-2020 17:55 14K [TXT] 8.2.0294 21-Feb-2020 18:43 13K [   ] 8.2.0295 21-Feb-2020 21:31 17K [TXT] 8.2.0296 22-Feb-2020 14:27 19K [TXT] 8.2.0297 22-Feb-2020 15:02 2.1K [   ] 8.2.0298 22-Feb-2020 18:37 5.5K [   ] 8.2.0299 22-Feb-2020 19:16 5.8K [   ] 8.2.0300 22-Feb-2020 20:34 1.7K [TXT] 8.2.0301 22-Feb-2020 21:22 8.0K [TXT] 8.2.0302 22-Feb-2020 22:46 3.0K [TXT] 8.2.0303 22-Feb-2020 23:09 1.4K [TXT] 8.2.0304 23-Feb-2020 13:30 1.8K [TXT] 8.2.0305 23-Feb-2020 13:38 3.3K [   ] 8.2.0306 23-Feb-2020 14:36 2.8K [   ] 8.2.0307 23-Feb-2020 15:11 2.9K [   ] 8.2.0308 23-Feb-2020 15:18 2.5K [   ] 8.2.0309 23-Feb-2020 15:30 5.8K [TXT] 8.2.0310 23-Feb-2020 16:17 2.8K [TXT] 8.2.0311 23-Feb-2020 18:44 2.5K [   ] 8.2.0312 23-Feb-2020 21:28 12K [   ] 8.2.0313 24-Feb-2020 21:39 5.4K [TXT] 8.2.0314 24-Feb-2020 21:39 1.8K [TXT] 8.2.0315 25-Feb-2020 21:34 2.9K [   ] 8.2.0316 25-Feb-2020 21:48 8.9K [TXT] 8.2.0317 25-Feb-2020 22:05 1.8K [   ] 8.2.0318 25-Feb-2020 22:59 4.4K [   ] 8.2.0319 26-Feb-2020 16:18 3.5K [   ] 8.2.0320 26-Feb-2020 16:18 217K [   ] 8.2.0321 26-Feb-2020 18:25 8.4K [   ] 8.2.0322 26-Feb-2020 20:16 5.6K [TXT] 8.2.0323 26-Feb-2020 21:25 8.3K [TXT] 8.2.0324 26-Feb-2020 22:06 8.6K [TXT] 8.2.0325 27-Feb-2020 21:33 11K [   ] 8.2.0326 27-Feb-2020 21:49 1.7K [TXT] 8.2.0327 28-Feb-2020 19:12 2.9K [TXT] 8.2.0328 28-Feb-2020 22:21 15K [TXT] 8.2.0329 28-Feb-2020 22:45 3.6K [TXT] 8.2.0330 28-Feb-2020 22:52 1.3K [   ] 8.2.0331 29-Feb-2020 13:44 3.1K [   ] 8.2.0332 29-Feb-2020 14:46 4.4K [TXT] 8.2.0333 29-Feb-2020 16:10 3.9K [TXT] 8.2.0334 29-Feb-2020 17:38 6.0K [TXT] 8.2.0335 29-Feb-2020 22:07 4.1K [   ] 8.2.0336 29-Feb-2020 23:25 12K [   ] 8.2.0337 01-Mar-2020 01:06 1.5K [TXT] 8.2.0338 01-Mar-2020 13:02 1.4K [TXT] 8.2.0339 01-Mar-2020 14:05 73K [TXT] 8.2.0340 01-Mar-2020 15:37 5.0K [TXT] 8.2.0341 01-Mar-2020 16:23 3.1K [   ] 8.2.0342 01-Mar-2020 16:53 5.6K [   ] 8.2.0343 01-Mar-2020 17:56 4.7K [TXT] 8.2.0344 01-Mar-2020 20:04 1.4K [TXT] 8.2.0345 01-Mar-2020 20:35 1.5K [   ] 8.2.0346 01-Mar-2020 23:33 7.7K [   ] 8.2.0347 02-Mar-2020 20:55 10K [   ] 8.2.0348 02-Mar-2020 22:54 11K [   ] 8.2.0349 03-Mar-2020 19:02 3.0K [TXT] 8.2.0350 03-Mar-2020 21:54 22K [TXT] 8.2.0351 03-Mar-2020 22:57 1.5K [TXT] 8.2.0352 03-Mar-2020 23:07 4.1K [TXT] 8.2.0353 04-Mar-2020 21:51 2.6K [TXT] 8.2.0354 04-Mar-2020 22:06 1.4K [   ] 8.2.0355 04-Mar-2020 23:22 4.3K [   ] 8.2.0356 04-Mar-2020 23:22 6.6K [TXT] 8.2.0357 05-Mar-2020 21:53 3.9K [   ] 8.2.0358 06-Mar-2020 20:36 8.8K [TXT] 8.2.0359 06-Mar-2020 21:44 2.2K [TXT] 8.2.0360 06-Mar-2020 22:28 1.9K [   ] 8.2.0361 07-Mar-2020 17:00 3.1K [   ] 8.2.0362 07-Mar-2020 17:26 2.1K [   ] 8.2.0363 08-Mar-2020 05:15 22K [   ] 8.2.0364 08-Mar-2020 18:44 2.5K [   ] 8.2.0365 09-Mar-2020 08:20 4.7K [   ] 8.2.0366 09-Mar-2020 12:15 7.2K [TXT] 8.2.0367 09-Mar-2020 16:44 2.1K [   ] 8.2.0368 09-Mar-2020 19:27 7.3K [   ] 8.2.0369 10-Mar-2020 07:50 34K [TXT] 8.2.0370 11-Mar-2020 13:03 2.4K [TXT] 8.2.0371 11-Mar-2020 14:21 6.6K [TXT] 8.2.0372 11-Mar-2020 19:17 4.4K [   ] 8.2.0373 11-Mar-2020 19:31 2.5K [   ] 8.2.0374 12-Mar-2020 19:17 1.5K [TXT] 8.2.0375 13-Mar-2020 14:38 3.3K [TXT] 8.2.0376 13-Mar-2020 14:56 1.4K [   ] 8.2.0377 13-Mar-2020 15:09 2.9K [TXT] 8.2.0378 13-Mar-2020 21:38 2.6K [TXT] 8.2.0379 14-Mar-2020 07:47 1.8K [   ] 8.2.0380 14-Mar-2020 15:28 5.6K [TXT] 8.2.0381 14-Mar-2020 17:23 2.7K [   ] 8.2.0382 15-Mar-2020 14:20 11K [   ] 8.2.0383 15-Mar-2020 14:55 1.6K [TXT] 8.2.0384 15-Mar-2020 15:10 3.6K [   ] 8.2.0385 15-Mar-2020 16:14 38K [   ] 8.2.0386 15-Mar-2020 16:53 1.7K [TXT] 8.2.0387 15-Mar-2020 18:16 2.3K [   ] 8.2.0388 15-Mar-2020 18:28 6.5K [   ] 8.2.0389 15-Mar-2020 19:18 1.6K [   ] 8.2.0390 15-Mar-2020 20:35 6.6K [TXT] 8.2.0391 16-Mar-2020 12:10 2.6K [TXT] 8.2.0392 16-Mar-2020 20:05 3.0K [   ] 8.2.0393 16-Mar-2020 20:08 2.2K [   ] 8.2.0394 16-Mar-2020 21:09 1.6K [   ] 8.2.0395 16-Mar-2020 21:09 1.8K [   ] 8.2.0396 16-Mar-2020 21:26 13K [TXT] 8.2.0397 16-Mar-2020 22:09 2.4K [   ] 8.2.0398 17-Mar-2020 20:58 4.9K [TXT] 8.2.0399 18-Mar-2020 15:24 4.7K [TXT] 8.2.0400 18-Mar-2020 19:19 4.1K [TXT] 8.2.0401 18-Mar-2020 19:33 17K [   ] 8.2.0402 18-Mar-2020 21:11 3.4K [TXT] 8.2.0403 19-Mar-2020 12:39 2.8K [   ] 8.2.0404 19-Mar-2020 13:09 2.0K [   ] 8.2.0405 19-Mar-2020 13:37 3.0K [   ] 8.2.0406 19-Mar-2020 13:55 2.2K [   ] 8.2.0407 19-Mar-2020 14:38 3.9K [TXT] 8.2.0408 19-Mar-2020 14:53 1.3K [TXT] 8.2.0409 19-Mar-2020 15:06 13K [   ] 8.2.0410 19-Mar-2020 16:23 2.0K [TXT] 8.2.0411 19-Mar-2020 16:29 1.8K [TXT] 8.2.0412 19-Mar-2020 17:14 2.8K [TXT] 8.2.0413 19-Mar-2020 18:52 21K [TXT] 8.2.0414 19-Mar-2020 19:45 5.4K [TXT] 8.2.0415 19-Mar-2020 20:32 3.1K [TXT] 8.2.0416 19-Mar-2020 20:34 1.6K [   ] 8.2.0417 20-Mar-2020 18:12 8.5K [   ] 8.2.0418 20-Mar-2020 18:21 20K [TXT] 8.2.0419 20-Mar-2020 18:40 18K [TXT] 8.2.0420 20-Mar-2020 19:38 3.0K [   ] 8.2.0421 20-Mar-2020 20:49 3.9K [   ] 8.2.0422 20-Mar-2020 21:16 2.5K [TXT] 8.2.0423 21-Mar-2020 15:20 5.4K [TXT] 8.2.0424 22-Mar-2020 13:45 2.4K [   ] 8.2.0425 22-Mar-2020 14:10 50K [   ] 8.2.0426 22-Mar-2020 14:42 5.5K [TXT] 8.2.0427 22-Mar-2020 16:18 37K [TXT] 8.2.0428 22-Mar-2020 19:26 2.8K [TXT] 8.2.0429 22-Mar-2020 20:14 1.5K [TXT] 8.2.0430 22-Mar-2020 21:24 5.1K [TXT] 8.2.0431 23-Mar-2020 19:18 1.9K [TXT] 8.2.0432 23-Mar-2020 19:29 6.0K [   ] 8.2.0433 23-Mar-2020 20:55 5.0K [TXT] 8.2.0434 23-Mar-2020 21:46 1.4K [   ] 8.2.0435 23-Mar-2020 22:02 2.0K [TXT] 8.2.0436 23-Mar-2020 22:13 13K [TXT] 8.2.0437 23-Mar-2020 22:17 6.5K [TXT] 8.2.0438 23-Mar-2020 22:47 2.6K [TXT] 8.2.0439 24-Mar-2020 10:24 5.0K [TXT] 8.2.0440 24-Mar-2020 10:33 3.3K [TXT] 8.2.0441 24-Mar-2020 12:13 2.8K [TXT] 8.2.0442 24-Mar-2020 20:36 2.7K [   ] 8.2.0443 24-Mar-2020 21:43 135K [TXT] 8.2.0444 24-Mar-2020 21:45 3.2K [   ] 8.2.0445 25-Mar-2020 20:17 2.3K [   ] 8.2.0446 25-Mar-2020 21:14 2.4K [TXT] 8.2.0447 25-Mar-2020 21:28 2.3K [   ] 8.2.0448 25-Mar-2020 22:24 24K [   ] 8.2.0449 26-Mar-2020 13:16 2.9K [   ] 8.2.0450 26-Mar-2020 14:12 11K [TXT] 8.2.0451 26-Mar-2020 15:40 1.6K [   ] 8.2.0452 26-Mar-2020 16:05 2.2K [   ] 8.2.0453 26-Mar-2020 16:28 3.2K [TXT] 8.2.0454 26-Mar-2020 16:51 6.3K [TXT] 8.2.0455 26-Mar-2020 20:34 19K [   ] 8.2.0456 26-Mar-2020 20:52 2.6K [TXT] 8.2.0457 26-Mar-2020 21:12 2.4K [TXT] 8.2.0458 26-Mar-2020 22:10 1.6K [   ] 8.2.0459 26-Mar-2020 22:17 47K [   ] 8.2.0460 26-Mar-2020 23:14 2.6K [   ] 8.2.0461 27-Mar-2020 19:41 1.5K [TXT] 8.2.0462 27-Mar-2020 20:25 3.3K [TXT] 8.2.0463 27-Mar-2020 20:53 2.5K [TXT] 8.2.0464 27-Mar-2020 21:00 5.5K [   ] 8.2.0465 28-Mar-2020 14:54 5.7K [TXT] 8.2.0466 28-Mar-2020 18:08 4.4K [   ] 8.2.0467 28-Mar-2020 19:42 8.0K [TXT] 8.2.0468 28-Mar-2020 20:45 7.0K [TXT] 8.2.0469 28-Mar-2020 21:38 4.3K [   ] 8.2.0470 28-Mar-2020 21:49 1.9K [TXT] 8.2.0471 28-Mar-2020 22:07 1.7K [TXT] 8.2.0472 28-Mar-2020 22:37 1.4K [TXT] 8.2.0473 29-Mar-2020 15:12 3.5K [   ] 8.2.0474 29-Mar-2020 16:07 3.3K [   ] 8.2.0475 29-Mar-2020 16:19 2.1K [   ] 8.2.0476 29-Mar-2020 17:52 2.3K [   ] 8.2.0477 29-Mar-2020 18:41 3.2K [TXT] 8.2.0478 29-Mar-2020 20:09 4.5K [   ] 8.2.0479 29-Mar-2020 20:52 4.5K [   ] 8.2.0480 29-Mar-2020 21:39 3.4K [   ] 8.2.0481 30-Mar-2020 19:14 6.9K [   ] 8.2.0482 30-Mar-2020 19:41 31K [TXT] 8.2.0483 30-Mar-2020 21:06 2.6K [   ] 8.2.0484 30-Mar-2020 21:23 2.8K [   ] 8.2.0485 30-Mar-2020 21:29 2.4K [   ] 8.2.0486 30-Mar-2020 22:52 7.8K [TXT] 8.2.0487 31-Mar-2020 23:14 9.3K [TXT] 8.2.0488 31-Mar-2020 23:33 5.2K [TXT] 8.2.0489 01-Apr-2020 16:35 6.1K [   ] 8.2.0490 01-Apr-2020 18:30 1.7K [TXT] 8.2.0491 01-Apr-2020 19:23 4.7K [TXT] 8.2.0492 01-Apr-2020 21:19 8.7K [TXT] 8.2.0493 01-Apr-2020 22:11 10K [TXT] 8.2.0494 01-Apr-2020 22:37 1.6K [TXT] 8.2.0495 01-Apr-2020 23:06 4.7K [   ] 8.2.0496 02-Apr-2020 13:51 3.3K [TXT] 8.2.0497 02-Apr-2020 15:18 2.5K [TXT] 8.2.0498 02-Apr-2020 16:01 1.7K [TXT] 8.2.0499 02-Apr-2020 18:35 9.0K [TXT] 8.2.0500 02-Apr-2020 18:52 65K [   ] 8.2.0501 02-Apr-2020 19:12 1.9K [   ] 8.2.0502 02-Apr-2020 21:14 19K [TXT] 8.2.0503 02-Apr-2020 22:34 7.8K [TXT] 8.2.0504 02-Apr-2020 22:58 2.3K [   ] 8.2.0505 03-Apr-2020 12:57 3.6K [TXT] 8.2.0506 03-Apr-2020 18:14 1.6K [TXT] 8.2.0507 03-Apr-2020 18:44 2.7K [   ] 8.2.0508 03-Apr-2020 22:00 30K [   ] 8.2.0509 04-Apr-2020 14:01 24K [   ] 8.2.0510 04-Apr-2020 14:51 2.4K [   ] 8.2.0511 05-Apr-2020 15:37 16K [TXT] 8.2.0512 05-Apr-2020 17:09 58K [TXT] 8.2.0513 05-Apr-2020 21:39 2.9K [TXT] 8.2.0514 05-Apr-2020 18:57 7.7K [   ] 8.2.0515 05-Apr-2020 19:09 3.2K [   ] 8.2.0516 05-Apr-2020 20:21 61K [   ] 8.2.0517 05-Apr-2020 21:39 20K [   ] 8.2.0518 05-Apr-2020 21:42 2.1K [TXT] 8.2.0519 05-Apr-2020 22:16 3.5K [   ] 8.2.0520 05-Apr-2020 23:05 1.6K [TXT] 8.2.0521 06-Apr-2020 21:13 3.3K [   ] 8.2.0522 06-Apr-2020 21:35 19K [   ] 8.2.0523 06-Apr-2020 22:13 24K [TXT] 8.2.0524 06-Apr-2020 22:57 4.1K [TXT] 8.2.0525 06-Apr-2020 23:50 2.2K [   ] 8.2.0526 09-Apr-2020 12:55 1.9K [   ] 8.2.0527 07-Apr-2020 20:54 11K [TXT] 8.2.0528 07-Apr-2020 22:05 4.8K [   ] 8.2.0529 07-Apr-2020 22:45 4.0K [TXT] 8.2.0530 08-Apr-2020 11:32 2.1K [   ] 8.2.0531 08-Apr-2020 19:49 18K [TXT] 8.2.0532 08-Apr-2020 20:04 3.7K [TXT] 8.2.0533 08-Apr-2020 21:51 79K [   ] 8.2.0534 08-Apr-2020 22:57 1.9K [   ] 8.2.0535 09-Apr-2020 18:43 16K [TXT] 8.2.0536 09-Apr-2020 20:11 7.0K [   ] 8.2.0537 09-Apr-2020 20:11 2.8K [   ] 8.2.0538 09-Apr-2020 21:08 6.3K [TXT] 8.2.0539 09-Apr-2020 21:34 2.6K [   ] 8.2.0540 11-Apr-2020 17:10 27K [   ] 8.2.0541 11-Apr-2020 18:03 12K [   ] 8.2.0542 11-Apr-2020 18:37 2.8K [TXT] 8.2.0543 11-Apr-2020 20:51 22K [TXT] 8.2.0544 11-Apr-2020 21:36 1.6K [TXT] 8.2.0545 11-Apr-2020 21:45 8.7K [TXT] 8.2.0546 11-Apr-2020 22:32 8.0K [TXT] 8.2.0547 11-Apr-2020 22:39 3.4K [   ] 8.2.0548 11-Apr-2020 23:19 5.9K [   ] 8.2.0549 12-Apr-2020 12:55 3.9K [TXT] 8.2.0550 12-Apr-2020 13:39 3.6K [   ] 8.2.0551 12-Apr-2020 13:51 8.9K [   ] 8.2.0552 12-Apr-2020 14:40 4.5K [TXT] 8.2.0553 12-Apr-2020 14:51 1.8K [TXT] 8.2.0554 12-Apr-2020 15:11 2.8K [TXT] 8.2.0555 12-Apr-2020 16:40 7.5K [   ] 8.2.0556 12-Apr-2020 17:12 1.9K [   ] 8.2.0557 12-Apr-2020 17:54 56K [   ] 8.2.0558 12-Apr-2020 18:02 2.3K [TXT] 8.2.0559 12-Apr-2020 19:38 78K [TXT] 8.2.0560 12-Apr-2020 20:03 2.7K [TXT] 8.2.0561 12-Apr-2020 20:20 7.1K [TXT] 8.2.0562 12-Apr-2020 20:56 17K [TXT] 8.2.0563 12-Apr-2020 21:53 8.2K [   ] 8.2.0564 12-Apr-2020 22:23 3.5K [   ] 8.2.0565 12-Apr-2020 22:54 48K [   ] 8.2.0566 12-Apr-2020 23:10 2.2K [TXT] 8.2.0567 13-Apr-2020 14:42 15K [TXT] 8.2.0568 13-Apr-2020 15:00 4.2K [TXT] 8.2.0569 13-Apr-2020 15:07 1.4K [TXT] 8.2.0570 13-Apr-2020 17:21 6.8K [TXT] 8.2.0571 13-Apr-2020 17:45 2.1K [   ] 8.2.0572 13-Apr-2020 18:14 1.4K [   ] 8.2.0573 13-Apr-2020 18:26 3.9K [   ] 8.2.0574 13-Apr-2020 19:05 2.4K [   ] 8.2.0575 13-Apr-2020 19:47 2.1K [   ] 8.2.0576 13-Apr-2020 19:56 3.1K [TXT] 8.2.0577 13-Apr-2020 21:17 11K [TXT] 8.2.0578 14-Apr-2020 20:16 166K [   ] 8.2.0579 14-Apr-2020 20:57 1.9K [TXT] 8.2.0580 15-Apr-2020 20:06 3.3K [TXT] 8.2.0581 15-Apr-2020 21:06 3.3K [   ] 8.2.0582 15-Apr-2020 21:45 3.8K [TXT] 8.2.0583 16-Apr-2020 13:01 5.5K [TXT] 8.2.0584 16-Apr-2020 21:05 1.8K [TXT] 8.2.0585 16-Apr-2020 22:11 9.1K [   ] 8.2.0586 16-Apr-2020 23:00 2.9K [TXT] 8.2.0587 16-Apr-2020 23:02 1.5K [TXT] 8.2.0588 17-Apr-2020 16:41 2.8K [   ] 8.2.0589 17-Apr-2020 19:23 2.6K [TXT] 8.2.0590 17-Apr-2020 19:42 10K [   ] 8.2.0591 17-Apr-2020 20:49 2.0K [TXT] 8.2.0592 17-Apr-2020 21:14 1.4K [TXT] 8.2.0593 18-Apr-2020 17:46 3.4K [   ] 8.2.0594 18-Apr-2020 19:09 5.4K [   ] 8.2.0595 18-Apr-2020 19:54 14K [TXT] 8.2.0596 18-Apr-2020 20:52 2.5K [   ] 8.2.0597 18-Apr-2020 21:57 12K [TXT] 8.2.0598 18-Apr-2020 23:21 2.0K [TXT] 8.2.0599 19-Apr-2020 14:03 39K [   ] 8.2.0600 19-Apr-2020 16:29 15K [TXT] 8.2.0601 19-Apr-2020 16:29 18K [TXT] 8.2.0602 19-Apr-2020 17:25 5.2K [   ] 8.2.0603 19-Apr-2020 17:47 3.4K [TXT] 8.2.0604 19-Apr-2020 18:13 2.5K [   ] 8.2.0605 19-Apr-2020 18:28 5.4K [   ] 8.2.0606 19-Apr-2020 18:32 6.4K [TXT] 8.2.0607 19-Apr-2020 22:59 3.2K [TXT] 8.2.0608 20-Apr-2020 16:12 1.8K [TXT] 8.2.0609 20-Apr-2020 16:22 2.6K [   ] 8.2.0610 20-Apr-2020 16:50 20K [   ] 8.2.0611 20-Apr-2020 18:43 4.8K [TXT] 8.2.0612 20-Apr-2020 19:42 11K [TXT] 8.2.0613 20-Apr-2020 22:43 19K [TXT] 8.2.0614 21-Apr-2020 22:02 13K [   ] 8.2.0615 21-Apr-2020 22:20 20K [TXT] 8.2.0616 21-Apr-2020 22:45 1.6K [   ] 8.2.0617 22-Apr-2020 17:37 2.5K [   ] 8.2.0618 22-Apr-2020 19:15 2.4K [TXT] 8.2.0619 23-Apr-2020 13:39 14K [   ] 8.2.0620 23-Apr-2020 13:58 5.6K [   ] 8.2.0621 23-Apr-2020 14:42 2.5K [TXT] 8.2.0622 23-Apr-2020 15:43 12K [   ] 8.2.0623 23-Apr-2020 15:47 1.5K [TXT] 8.2.0624 23-Apr-2020 17:08 8.4K [TXT] 8.2.0625 23-Apr-2020 18:14 4.6K [TXT] 8.2.0626 23-Apr-2020 22:17 14K [TXT] 8.2.0627 23-Apr-2020 22:24 1.4K [   ] 8.2.0628 23-Apr-2020 23:55 79K [TXT] 8.2.0629 24-Apr-2020 20:58 2.9K [TXT] 8.2.0630 24-Apr-2020 21:22 1.2K [   ] 8.2.0631 24-Apr-2020 22:17 250K [TXT] 8.2.0632 24-Apr-2020 22:20 1.4K [   ] 8.2.0633 24-Apr-2020 22:48 13K [   ] 8.2.0634 25-Apr-2020 15:25 19K [   ] 8.2.0635 25-Apr-2020 15:36 1.6K [TXT] 8.2.0636 25-Apr-2020 15:46 1.5K [TXT] 8.2.0637 25-Apr-2020 15:54 3.2K [TXT] 8.2.0638 25-Apr-2020 16:42 1.5K [TXT] 8.2.0639 25-Apr-2020 17:14 3.4K [   ] 8.2.0640 25-Apr-2020 20:03 41K [TXT] 8.2.0641 26-Apr-2020 13:51 5.0K [   ] 8.2.0642 26-Apr-2020 14:30 2.4K [TXT] 8.2.0643 26-Apr-2020 15:35 2.9K [   ] 8.2.0644 26-Apr-2020 16:00 17K [   ] 8.2.0645 26-Apr-2020 16:06 1.8K [TXT] 8.2.0646 26-Apr-2020 16:53 3.0K [TXT] 8.2.0647 26-Apr-2020 19:01 2.1K [TXT] 8.2.0648 27-Apr-2020 19:29 2.8K [   ] 8.2.0649 27-Apr-2020 20:19 2.8K [   ] 8.2.0650 27-Apr-2020 22:48 35K [TXT] 8.2.0651 27-Apr-2020 23:18 1.5K [TXT] 8.2.0652 27-Apr-2020 23:18 2.1K [   ] 8.2.0653 27-Apr-2020 23:40 4.7K [   ] 8.2.0654 28-Apr-2020 00:03 1.5K [   ] 8.2.0655 28-Apr-2020 20:29 26K [TXT] 8.2.0656 28-Apr-2020 20:45 3.3K [TXT] 8.2.0657 28-Apr-2020 21:30 6.0K [   ] 8.2.0658 28-Apr-2020 21:59 1.7K [   ] 8.2.0659 28-Apr-2020 22:50 3.9K [TXT] 8.2.0660 29-Apr-2020 21:05 115K [TXT] 8.2.0661 29-Apr-2020 22:02 24K [   ] 8.2.0662 29-Apr-2020 22:31 4.7K [   ] 8.2.0663 29-Apr-2020 23:04 3.8K [TXT] 8.2.0664 29-Apr-2020 23:17 8.5K [TXT] 8.2.0665 30-Apr-2020 19:10 5.9K [TXT] 8.2.0666 30-Apr-2020 19:20 3.2K [   ] 8.2.0667 30-Apr-2020 19:55 26K [   ] 8.2.0668 30-Apr-2020 20:22 1.5K [TXT] 8.2.0669 30-Apr-2020 21:00 16K [   ] 8.2.0670 30-Apr-2020 22:32 20K [TXT] 8.2.0671 30-Apr-2020 22:51 3.3K [   ] 8.2.0672 01-May-2020 14:11 5.4K [   ] 8.2.0673 01-May-2020 14:14 1.7K [   ] 8.2.0674 01-May-2020 14:27 78K [TXT] 8.2.0675 01-May-2020 15:45 22K [   ] 8.2.0676 01-May-2020 16:08 1.6K [TXT] 8.2.0677 01-May-2020 19:29 23K [   ] 8.2.0678 02-May-2020 14:53 1.7K [TXT] 8.2.0679 02-May-2020 17:53 27K [TXT] 8.2.0680 02-May-2020 18:15 6.7K [TXT] 8.2.0681 02-May-2020 18:34 1.5K [   ] 8.2.0682 02-May-2020 19:05 1.8K [   ] 8.2.0683 02-May-2020 23:13 6.2K [TXT] 8.2.0684 03-May-2020 15:39 12K [TXT] 8.2.0685 03-May-2020 15:54 2.0K [   ] 8.2.0686 03-May-2020 16:05 7.4K [TXT] 8.2.0687 03-May-2020 16:30 5.1K [   ] 8.2.0688 03-May-2020 17:02 2.7K [TXT] 8.2.0689 03-May-2020 17:04 2.2K [TXT] 8.2.0690 03-May-2020 17:20 3.3K [   ] 8.2.0691 03-May-2020 17:56 2.0K [   ] 8.2.0692 03-May-2020 18:21 2.0K [TXT] 8.2.0693 03-May-2020 22:31 6.0K [TXT] 8.2.0694 03-May-2020 22:58 7.7K [TXT] 8.2.0695 04-May-2020 23:25 16K [TXT] 8.2.0696 05-May-2020 18:06 5.8K [   ] 8.2.0697 05-May-2020 19:47 3.0K [   ] 8.2.0698 05-May-2020 19:58 7.7K [TXT] 8.2.0699 05-May-2020 22:09 9.0K [   ] 8.2.0700 05-May-2020 22:09 2.6K [   ] 8.2.0701 05-May-2020 23:33 2.0K [   ] 8.2.0702 06-May-2020 19:38 1.5K [   ] 8.2.0703 06-May-2020 21:07 9.0K [   ] 8.2.0704 06-May-2020 22:19 2.7K [TXT] 8.2.0705 06-May-2020 22:37 1.8K [   ] 8.2.0706 07-May-2020 14:08 3.1K [   ] 8.2.0707 07-May-2020 14:38 1.6K [TXT] 8.2.0708 07-May-2020 16:59 24K [   ] 8.2.0709 07-May-2020 17:49 1.5K [TXT] 8.2.0710 07-May-2020 18:17 1.5K [TXT] 8.2.0711 07-May-2020 18:37 6.5K [   ] 8.2.0712 07-May-2020 18:44 5.1K [TXT] 8.2.0713 07-May-2020 22:20 2.1K [TXT] 8.2.0714 07-May-2020 22:20 13K [TXT] 8.2.0715 07-May-2020 22:24 1.4K [TXT] 8.2.0716 07-May-2020 23:21 2.7K [TXT] 8.2.0717 08-May-2020 19:11 20K [TXT] 8.2.0718 09-May-2020 13:07 1.6K [TXT] 8.2.0719 09-May-2020 15:45 45K [   ] 8.2.0720 09-May-2020 16:12 2.1K [   ] 8.2.0721 09-May-2020 16:45 1.7K [TXT] 8.2.0722 09-May-2020 17:40 13K [TXT] 8.2.0723 09-May-2020 18:30 5.1K [   ] 8.2.0724 09-May-2020 18:45 1.9K [TXT] 8.2.0725 09-May-2020 22:51 19K [TXT] 8.2.0726 09-May-2020 23:21 2.3K [TXT] 8.2.0727 10-May-2020 13:43 1.9K [TXT] 8.2.0728 10-May-2020 14:14 2.9K [TXT] 8.2.0729 10-May-2020 15:25 5.9K [   ] 8.2.0730 10-May-2020 19:11 32K [TXT] 8.2.0731 10-May-2020 21:21 2.2K [   ] 8.2.0732 10-May-2020 21:48 2.2K [TXT] 8.2.0733 10-May-2020 22:54 5.5K [TXT] 8.2.0734 10-May-2020 23:12 1.7K [TXT] 8.2.0735 10-May-2020 23:20 2.0K [   ] 8.2.0736 11-May-2020 19:47 2.7K [TXT] 8.2.0737 11-May-2020 20:56 3.6K [TXT] 8.2.0738 11-May-2020 22:14 22K [TXT] 8.2.0739 11-May-2020 23:21 4.7K [   ] 8.2.0740 11-May-2020 23:21 12K [TXT] 8.2.0741 12-May-2020 13:08 50K [TXT] 8.2.0742 12-May-2020 14:42 2.8K [   ] 8.2.0743 12-May-2020 22:03 2.6K [TXT] 8.2.0744 12-May-2020 23:46 1.9K [   ] 8.2.0745 12-May-2020 23:46 2.4K [TXT] 8.2.0746 13-May-2020 01:05 4.6K [TXT] 8.2.0747 13-May-2020 13:40 14K [TXT] 8.2.0748 13-May-2020 16:34 7.6K [TXT] 8.2.0749 13-May-2020 17:16 1.7K [   ] 8.2.0750 13-May-2020 17:16 2.5K [   ] 8.2.0751 13-May-2020 23:32 26K [   ] 8.2.0752 13-May-2020 23:32 2.1K [TXT] 8.2.0753 14-May-2020 22:42 44K [   ] 8.2.0754 14-May-2020 23:21 1.9K [TXT] 8.2.0755 15-May-2020 18:18 5.2K [TXT] 8.2.0756 15-May-2020 18:22 1.8K [   ] 8.2.0757 15-May-2020 19:22 11K [   ] 8.2.0758 15-May-2020 21:43 22K [TXT] 8.2.0759 15-May-2020 21:43 10K [   ] 8.2.0760 15-May-2020 21:45 2.7K [   ] 8.2.0761 15-May-2020 22:02 5.7K [TXT] 8.2.0762 15-May-2020 22:31 2.3K [TXT] 8.2.0763 15-May-2020 22:47 1.5K [   ] 8.2.0764 15-May-2020 23:41 3.9K [TXT] 8.2.0765 16-May-2020 14:02 12K [TXT] 8.2.0766 16-May-2020 14:08 3.2K [   ] 8.2.0767 16-May-2020 15:05 1.7K [   ] 8.2.0768 16-May-2020 15:44 1.8K [TXT] 8.2.0769 16-May-2020 16:22 3.2K [TXT] 8.2.0770 16-May-2020 18:58 3.0K [   ] 8.2.0771 16-May-2020 22:36 7.9K [   ] 8.2.0772 16-May-2020 22:36 2.5K [TXT] 8.2.0773 16-May-2020 23:15 5.4K [TXT] 8.2.0774 17-May-2020 14:07 12K [TXT] 8.2.0775 17-May-2020 14:34 12K [TXT] 8.2.0776 17-May-2020 15:00 6.8K [   ] 8.2.0777 17-May-2020 15:10 2.1K [TXT] 8.2.0778 17-May-2020 16:10 8.1K [TXT] 8.2.0779 17-May-2020 16:10 2.1K [TXT] 8.2.0780 17-May-2020 16:30 44K [   ] 8.2.0781 17-May-2020 16:57 1.5K [TXT] 8.2.0782 17-May-2020 18:54 2.2K [TXT] 8.2.0783 17-May-2020 20:53 11K [TXT] 8.2.0784 17-May-2020 21:52 10K [TXT] 8.2.0785 17-May-2020 22:34 9.1K [TXT] 8.2.0786 17-May-2020 22:34 2.3K [TXT] 8.2.0787 17-May-2020 23:02 17K [   ] 8.2.0788 17-May-2020 23:35 1.7K [   ] 8.2.0789 18-May-2020 13:38 3.8K [   ] 8.2.0790 18-May-2020 14:21 3.7K [TXT] 8.2.0791 18-May-2020 19:47 11K [TXT] 8.2.0792 18-May-2020 20:12 1.3K [TXT] 8.2.0793 18-May-2020 20:18 2.1K [TXT] 8.2.0794 18-May-2020 21:13 15K [TXT] 8.2.0795 18-May-2020 21:51 23K [   ] 8.2.0796 18-May-2020 23:28 1.6K [   ] 8.2.0797 19-May-2020 10:33 1.5K [TXT] 8.2.0798 19-May-2020 21:30 49K [   ] 8.2.0799 19-May-2020 21:44 2.7K [TXT] 8.2.0800 19-May-2020 23:11 8.0K [   ] 8.2.0801 19-May-2020 23:11 3.4K [TXT] 8.2.0802 20-May-2020 18:42 17K [TXT] 8.2.0803 20-May-2020 19:31 11K [TXT] 8.2.0804 21-May-2020 20:14 45K [   ] 8.2.0805 21-May-2020 20:40 4.0K [TXT] 8.2.0806 21-May-2020 21:51 2.5K [   ] 8.2.0807 22-May-2020 13:11 18K [TXT] 8.2.0808 22-May-2020 13:34 10K [   ] 8.2.0809 22-May-2020 13:41 3.1K [   ] 8.2.0810 22-May-2020 14:46 2.3K [   ] 8.2.0811 22-May-2020 14:46 3.2K [   ] 8.2.0812 22-May-2020 20:09 4.7K [   ] 8.2.0813 22-May-2020 22:07 52K [   ] 8.2.0814 23-May-2020 19:30 1.7K [   ] 8.2.0815 24-May-2020 13:11 14K [TXT] 8.2.0816 24-May-2020 17:24 6.9K [TXT] 8.2.0817 24-May-2020 18:46 3.2K [TXT] 8.2.0818 24-May-2020 23:15 58K [TXT] 8.2.0819 24-May-2020 23:15 1.3K [TXT] 8.2.0820 24-May-2020 23:46 9.3K [TXT] 8.2.0821 25-May-2020 00:29 2.3K [TXT] 8.2.0822 25-May-2020 20:42 8.1K [TXT] 8.2.0823 25-May-2020 22:37 18K [TXT] 8.2.0824 25-May-2020 23:02 2.4K [   ] 8.2.0825 26-May-2020 11:10 1.7K [TXT] 8.2.0826 26-May-2020 11:10 2.1K [TXT] 8.2.0827 26-May-2020 20:09 1.3K [TXT] 8.2.0828 26-May-2020 20:09 4.9K [   ] 8.2.0829 26-May-2020 20:22 2.5K [TXT] 8.2.0830 26-May-2020 22:16 1.5K [   ] 8.2.0831 27-May-2020 21:23 2.5K [   ] 8.2.0832 27-May-2020 21:30 1.6K [TXT] 8.2.0833 27-May-2020 22:09 1.4K [TXT] 8.2.0834 27-May-2020 23:19 2.1K [TXT] 8.2.0835 28-May-2020 21:04 2.6K [TXT] 8.2.0836 29-May-2020 21:41 4.7K [TXT] 8.2.0837 29-May-2020 21:48 1.9K [   ] 8.2.0838 29-May-2020 21:43 1.6K [TXT] 8.2.0839 29-May-2020 22:42 8.2K [TXT] 8.2.0840 29-May-2020 22:50 3.5K [TXT] 8.2.0841 29-May-2020 23:04 2.8K [TXT] 8.2.0842 30-May-2020 13:08 1.9K [   ] 8.2.0843 30-May-2020 13:16 2.0K [   ] 8.2.0844 30-May-2020 14:47 18K [   ] 8.2.0845 30-May-2020 15:32 28K [TXT] 8.2.0846 30-May-2020 16:18 1.4K [   ] 8.2.0847 30-May-2020 17:07 89K [TXT] 8.2.0848 30-May-2020 17:50 8.0K [TXT] 8.2.0849 30-May-2020 18:16 33K [TXT] 8.2.0850 30-May-2020 18:38 13K [TXT] 8.2.0851 30-May-2020 19:53 6.3K [   ] 8.2.0852 30-May-2020 20:05 1.6K [TXT] 8.2.0853 30-May-2020 20:31 24K [TXT] 8.2.0854 30-May-2020 21:53 6.0K [TXT] 8.2.0855 30-May-2020 21:53 16K [TXT] 8.2.0856 31-May-2020 13:12 1.9K [TXT] 8.2.0857 31-May-2020 13:53 1.9K [   ] 8.2.0858 31-May-2020 14:10 8.2K [TXT] 8.2.0859 31-May-2020 14:26 55K [TXT] 8.2.0860 31-May-2020 15:09 12K [TXT] 8.2.0861 31-May-2020 15:42 8.3K [TXT] 8.2.0862 31-May-2020 16:05 3.8K [TXT] 8.2.0863 31-May-2020 16:59 23K [TXT] 8.2.0864 31-May-2020 17:50 5.0K [TXT] 8.2.0865 31-May-2020 19:49 12K [   ] 8.2.0866 31-May-2020 21:28 20K [TXT] 8.2.0867 31-May-2020 22:07 9.3K [TXT] 8.2.0868 31-May-2020 22:21 8.3K [TXT] 8.2.0869 31-May-2020 23:12 28K [TXT] 8.2.0870 01-Jun-2020 14:09 1.6K [TXT] 8.2.0871 01-Jun-2020 14:15 4.7K [TXT] 8.2.0872 01-Jun-2020 14:35 105K [   ] 8.2.0873 01-Jun-2020 15:06 2.9K [TXT] 8.2.0874 01-Jun-2020 15:06 2.2K [   ] 8.2.0875 01-Jun-2020 16:10 30K [TXT] 8.2.0876 01-Jun-2020 16:27 4.4K [TXT] 8.2.0877 01-Jun-2020 17:29 28K [TXT] 8.2.0878 01-Jun-2020 18:40 9.2K [   ] 8.2.0879 01-Jun-2020 18:56 1.5K [TXT] 8.2.0880 01-Jun-2020 19:09 1.5K [   ] 8.2.0881 01-Jun-2020 19:15 1.5K [TXT] 8.2.0882 01-Jun-2020 20:11 4.0K [TXT] 8.2.0883 01-Jun-2020 21:14 1.3K [   ] 8.2.0884 01-Jun-2020 21:33 4.0K [TXT] 8.2.0885 02-Jun-2020 20:27 1.8K [TXT] 8.2.0886 02-Jun-2020 22:07 10K [   ] 8.2.0887 02-Jun-2020 22:07 2.5K [   ] 8.2.0888 02-Jun-2020 22:20 2.8K [TXT] 8.2.0889 02-Jun-2020 22:25 6.2K [TXT] 8.2.0890 02-Jun-2020 23:19 1.8K [   ] 8.2.0891 03-Jun-2020 10:05 1.6K [   ] 8.2.0892 03-Jun-2020 18:58 2.8K [TXT] 8.2.0893 03-Jun-2020 19:56 6.1K [TXT] 8.2.0894 03-Jun-2020 20:51 8.8K [TXT] 8.2.0895 03-Jun-2020 22:17 11K [TXT] 8.2.0896 03-Jun-2020 22:59 2.9K [TXT] 8.2.0897 04-Jun-2020 15:23 24K [TXT] 8.2.0898 04-Jun-2020 16:53 4.9K [TXT] 8.2.0899 04-Jun-2020 16:53 4.6K [TXT] 8.2.0900 04-Jun-2020 17:20 2.3K [TXT] 8.2.0901 04-Jun-2020 18:22 17K [TXT] 8.2.0902 04-Jun-2020 20:57 4.2K [   ] 8.2.0903 04-Jun-2020 21:33 1.7K [   ] 8.2.0904 04-Jun-2020 22:23 2.5K [   ] 8.2.0905 04-Jun-2020 22:46 2.6K [TXT] 8.2.0906 05-Jun-2020 19:37 2.7K [   ] 8.2.0907 05-Jun-2020 20:04 2.4K [TXT] 8.2.0908 05-Jun-2020 21:07 5.2K [TXT] 8.2.0909 05-Jun-2020 23:17 9.7K [TXT] 8.2.0910 06-Jun-2020 15:15 5.7K [TXT] 8.2.0911 06-Jun-2020 15:15 4.5K [TXT] 8.2.0912 06-Jun-2020 15:24 5.9K [TXT] 8.2.0913 06-Jun-2020 16:00 3.8K [TXT] 8.2.0914 06-Jun-2020 16:19 2.9K [   ] 8.2.0915 06-Jun-2020 18:39 15K [TXT] 8.2.0916 06-Jun-2020 22:43 8.4K [TXT] 8.2.0917 07-Jun-2020 14:11 6.4K [TXT] 8.2.0918 07-Jun-2020 14:51 12K [TXT] 8.2.0919 07-Jun-2020 15:46 4.7K [TXT] 8.2.0920 07-Jun-2020 17:04 3.5K [TXT] 8.2.0921 07-Jun-2020 17:04 3.2K [   ] 8.2.0922 07-Jun-2020 17:26 2.9K [   ] 8.2.0923 07-Jun-2020 17:59 2.3K [   ] 8.2.0924 07-Jun-2020 18:17 15K [TXT] 8.2.0925 07-Jun-2020 18:45 7.6K [TXT] 8.2.0926 07-Jun-2020 19:39 4.6K [   ] 8.2.0927 07-Jun-2020 20:08 3.0K [TXT] 8.2.0928 07-Jun-2020 20:49 12K [   ] 8.2.0929 07-Jun-2020 21:32 3.9K [TXT] 8.2.0930 07-Jun-2020 21:59 4.2K [TXT] 8.2.0931 07-Jun-2020 22:24 20K [   ] 8.2.0932 08-Jun-2020 18:55 3.2K [TXT] 8.2.0933 08-Jun-2020 19:22 7.3K [TXT] 8.2.0934 08-Jun-2020 19:36 2.8K [   ] 8.2.0935 08-Jun-2020 20:51 11K [TXT] 8.2.0936 09-Jun-2020 16:00 18K [TXT] 8.2.0937 09-Jun-2020 17:31 1.7K [   ] 8.2.0938 09-Jun-2020 19:35 6.2K [TXT] 8.2.0939 09-Jun-2020 21:36 37K [TXT] 8.2.0940 09-Jun-2020 21:36 2.3K [TXT] 8.2.0941 10-Jun-2020 12:16 17K [   ] 8.2.0942 10-Jun-2020 13:13 2.9K [TXT] 8.2.0943 10-Jun-2020 14:17 12K [TXT] 8.2.0944 10-Jun-2020 14:22 1.4K [TXT] 8.2.0945 10-Jun-2020 15:34 10K [   ] 8.2.0946 10-Jun-2020 15:46 3.4K [TXT] 8.2.0947 10-Jun-2020 15:57 3.6K [TXT] 8.2.0948 10-Jun-2020 16:40 3.1K [TXT] 8.2.0949 10-Jun-2020 16:56 1.9K [TXT] 8.2.0950 10-Jun-2020 17:14 1.5K [   ] 8.2.0951 10-Jun-2020 20:22 1.5K [TXT] 8.2.0952 10-Jun-2020 20:57 8.2K [TXT] 8.2.0953 10-Jun-2020 21:47 7.7K [TXT] 8.2.0954 10-Jun-2020 22:09 2.6K [TXT] 8.2.0955 10-Jun-2020 22:12 1.5K [TXT] 8.2.0956 10-Jun-2020 22:18 2.7K [TXT] 8.2.0957 11-Jun-2020 12:31 1.5K [TXT] 8.2.0958 11-Jun-2020 19:23 3.9K [TXT] 8.2.0959 11-Jun-2020 19:36 12K [TXT] 8.2.0960 11-Jun-2020 23:14 7.2K [TXT] 8.2.0961 12-Jun-2020 19:36 11K [   ] 8.2.0962 12-Jun-2020 20:12 1.8K [TXT] 8.2.0963 12-Jun-2020 20:20 5.2K [TXT] 8.2.0964 12-Jun-2020 22:09 4.0K [TXT] 8.2.0965 12-Jun-2020 22:16 2.0K [TXT] 8.2.0966 12-Jun-2020 22:31 4.9K [TXT] 8.2.0967 12-Jun-2020 23:00 30K [TXT] 8.2.0968 13-Jun-2020 13:21 21K [TXT] 8.2.0969 13-Jun-2020 15:14 5.7K [TXT] 8.2.0970 13-Jun-2020 15:48 16K [TXT] 8.2.0971 13-Jun-2020 16:40 1.9K [   ] 8.2.0972 13-Jun-2020 18:10 6.4K [TXT] 8.2.0973 13-Jun-2020 19:01 5.9K [TXT] 8.2.0974 13-Jun-2020 19:57 1.4K [TXT] 8.2.0975 14-Jun-2020 12:51 3.1K [   ] 8.2.0976 14-Jun-2020 13:52 15K [TXT] 8.2.0977 14-Jun-2020 14:35 4.1K [TXT] 8.2.0978 14-Jun-2020 15:37 1.8K [TXT] 8.2.0979 14-Jun-2020 16:44 2.1K [   ] 8.2.0980 14-Jun-2020 20:05 2.4K [TXT] 8.2.0981 14-Jun-2020 23:05 47K [TXT] 8.2.0982 15-Jun-2020 19:52 10K [   ] 8.2.0983 15-Jun-2020 20:26 2.7K [TXT] 8.2.0984 15-Jun-2020 21:20 3.4K [   ] 8.2.0985 15-Jun-2020 21:45 3.5K [   ] 8.2.0986 15-Jun-2020 23:19 2.0K [TXT] 8.2.0987 16-Jun-2020 11:36 12K [TXT] 8.2.0988 16-Jun-2020 20:04 32K [   ] 8.2.0989 16-Jun-2020 20:59 2.7K [TXT] 8.2.0990 16-Jun-2020 22:28 2.7K [TXT] 8.2.0991 16-Jun-2020 22:42 3.9K [TXT] 8.2.0992 16-Jun-2020 23:21 5.5K [   ] 8.2.0993 17-Jun-2020 12:05 2.3K [   ] 8.2.0994 17-Jun-2020 20:04 2.4K [TXT] 8.2.0995 17-Jun-2020 20:31 2.0K [TXT] 8.2.0996 17-Jun-2020 21:42 2.9K [TXT] 8.2.0997 17-Jun-2020 21:48 7.3K [   ] 8.2.0998 17-Jun-2020 22:59 3.4K [TXT] 8.2.0999 18-Jun-2020 17:30 2.8K [TXT] 8.2.1000 18-Jun-2020 17:30 2.8K [TXT] 8.2.1001 18-Jun-2020 18:27 5.6K [TXT] 8.2.1002 18-Jun-2020 18:35 1.9K [TXT] 8.2.1003 18-Jun-2020 18:46 2.8K [TXT] 8.2.1004 18-Jun-2020 19:16 8.5K [TXT] 8.2.1005 18-Jun-2020 19:31 12K [TXT] 8.2.1006 18-Jun-2020 20:52 13K [   ] 8.2.1007 18-Jun-2020 21:15 2.3K [   ] 8.2.1008 18-Jun-2020 22:44 2.4K [   ] 8.2.1009 18-Jun-2020 22:44 2.9K [   ] 8.2.1010 19-Jun-2020 17:22 1.8K [   ] 8.2.1011 19-Jun-2020 18:35 6.8K [   ] 8.2.1012 19-Jun-2020 19:02 3.7K [TXT] 8.2.1013 19-Jun-2020 19:11 4.1K [TXT] 8.2.1014 19-Jun-2020 19:31 5.3K [TXT] 8.2.1015 19-Jun-2020 21:47 4.6K [TXT] 8.2.1016 19-Jun-2020 22:36 1.5K [TXT] 8.2.1017 19-Jun-2020 22:38 2.9K [TXT] 8.2.1018 20-Jun-2020 13:30 4.7K [TXT] 8.2.1019 20-Jun-2020 14:44 5.2K [TXT] 8.2.1020 20-Jun-2020 15:04 1.6K [   ] 8.2.1021 20-Jun-2020 16:02 2.3K [   ] 8.2.1022 20-Jun-2020 16:06 20K [TXT] 8.2.1023 20-Jun-2020 18:20 18K [   ] 8.2.1024 20-Jun-2020 22:51 7.4K [TXT] 8.2.1025 21-Jun-2020 13:24 4.8K [TXT] 8.2.1026 21-Jun-2020 14:13 4.5K [   ] 8.2.1027 21-Jun-2020 15:10 2.9K [TXT] 8.2.1028 21-Jun-2020 15:53 10K [TXT] 8.2.1029 21-Jun-2020 16:59 9.4K [TXT] 8.2.1030 21-Jun-2020 17:58 3.4K [TXT] 8.2.1031 21-Jun-2020 20:07 2.2K [TXT] 8.2.1032 21-Jun-2020 20:39 3.1K [TXT] 8.2.1033 21-Jun-2020 20:40 2.2K [   ] 8.2.1034 21-Jun-2020 22:18 1.8K [TXT] 8.2.1035 22-Jun-2020 19:11 6.1K [   ] 8.2.1036 22-Jun-2020 19:25 1.8K [   ] 8.2.1037 22-Jun-2020 19:40 2.4K [   ] 8.2.1038 22-Jun-2020 22:10 1.8K [TXT] 8.2.1039 22-Jun-2020 20:31 2.5K [   ] 8.2.1040 22-Jun-2020 22:10 24K [TXT] 8.2.1041 22-Jun-2020 22:10 2.1K [TXT] 8.2.1042 22-Jun-2020 23:04 9.7K [   ] 8.2.1043 23-Jun-2020 20:01 1.8K [   ] 8.2.1044 23-Jun-2020 21:02 4.4K [TXT] 8.2.1045 23-Jun-2020 22:27 16K [   ] 8.2.1046 24-Jun-2020 13:39 22K [TXT] 8.2.1047 24-Jun-2020 18:38 40K [TXT] 8.2.1048 24-Jun-2020 19:06 1.3K [TXT] 8.2.1049 24-Jun-2020 20:34 27K [TXT] 8.2.1050 24-Jun-2020 21:01 1.8K [TXT] 8.2.1051 24-Jun-2020 22:08 3.0K [   ] 8.2.1052 24-Jun-2020 23:03 1.6K [   ] 8.2.1053 25-Jun-2020 19:02 5.1K [   ] 8.2.1054 25-Jun-2020 19:28 12K [   ] 8.2.1055 25-Jun-2020 19:54 3.3K [   ] 8.2.1056 25-Jun-2020 20:08 11K [TXT] 8.2.1057 25-Jun-2020 21:31 2.4K [   ] 8.2.1058 25-Jun-2020 22:24 3.1K [TXT] 8.2.1059 26-Jun-2020 19:44 3.7K [   ] 8.2.1060 26-Jun-2020 20:42 2.5K [   ] 8.2.1061 26-Jun-2020 20:42 13K [TXT] 8.2.1062 26-Jun-2020 21:29 3.5K [   ] 8.2.1063 26-Jun-2020 21:39 4.8K [   ] 8.2.1064 26-Jun-2020 22:01 3.1K [TXT] 8.2.1065 26-Jun-2020 22:47 10K [TXT] 8.2.1066 27-Jun-2020 12:33 6.2K [   ] 8.2.1067 27-Jun-2020 13:12 9.2K [   ] 8.2.1068 27-Jun-2020 14:12 8.7K [TXT] 8.2.1069 27-Jun-2020 16:36 2.0K [TXT] 8.2.1070 27-Jun-2020 17:04 1.3K [   ] 8.2.1071 27-Jun-2020 18:07 23K [   ] 8.2.1072 27-Jun-2020 18:14 2.6K [   ] 8.2.1073 27-Jun-2020 20:47 2.9K [TXT] 8.2.1074 27-Jun-2020 21:18 13K [   ] 8.2.1075 27-Jun-2020 21:56 2.1K [   ] 8.2.1076 27-Jun-2020 23:08 6.2K [TXT] 8.2.1077 28-Jun-2020 13:11 8.7K [   ] 8.2.1078 28-Jun-2020 15:52 76K [   ] 8.2.1079 28-Jun-2020 15:52 14K [TXT] 8.2.1080 28-Jun-2020 18:44 13K [TXT] 8.2.1081 28-Jun-2020 22:42 5.3K [   ] 8.2.1082 29-Jun-2020 19:56 2.6K [TXT] 8.2.1083 29-Jun-2020 20:10 3.4K [   ] 8.2.1084 29-Jun-2020 20:21 2.5K [   ] 8.2.1085 29-Jun-2020 20:24 2.6K [TXT] 8.2.1086 29-Jun-2020 20:41 3.5K [TXT] 8.2.1087 29-Jun-2020 21:15 1.7K [TXT] 8.2.1088 29-Jun-2020 21:32 2.3K [   ] 8.2.1089 29-Jun-2020 22:25 2.2K [TXT] 8.2.1090 29-Jun-2020 22:32 1.6K [TXT] 8.2.1091 29-Jun-2020 22:41 1.6K [   ] 8.2.1092 29-Jun-2020 23:03 1.5K [TXT] 8.2.1093 29-Jun-2020 23:08 1.3K [   ] 8.2.1094 29-Jun-2020 23:15 1.5K [   ] 8.2.1095 29-Jun-2020 23:19 2.2K [TXT] 8.2.1096 30-Jun-2020 13:39 4.2K [   ] 8.2.1097 30-Jun-2020 18:46 3.5K [   ] 8.2.1098 30-Jun-2020 20:56 2.7K [TXT] 8.2.1099 30-Jun-2020 21:19 4.6K [TXT] 8.2.1100 30-Jun-2020 22:02 4.9K [TXT] 8.2.1101 30-Jun-2020 22:12 2.2K [TXT] 8.2.1102 01-Jul-2020 13:05 3.5K [TXT] 8.2.1103 01-Jul-2020 13:08 1.5K [TXT] 8.2.1104 01-Jul-2020 13:16 1.8K [   ] 8.2.1105 01-Jul-2020 13:53 15K [TXT] 8.2.1106 01-Jul-2020 14:39 2.9K [TXT] 8.2.1107 01-Jul-2020 15:13 4.0K [   ] 8.2.1108 01-Jul-2020 15:50 12K [   ] 8.2.1109 01-Jul-2020 16:01 1.8K [TXT] 8.2.1110 01-Jul-2020 17:29 17K [   ] 8.2.1111 01-Jul-2020 18:31 23K [   ] 8.2.1112 01-Jul-2020 20:08 6.6K [   ] 8.2.1113 01-Jul-2020 20:20 1.7K [TXT] 8.2.1114 01-Jul-2020 21:55 102K [   ] 8.2.1115 02-Jul-2020 21:00 2.0K [   ] 8.2.1116 02-Jul-2020 21:12 3.7K [TXT] 8.2.1117 02-Jul-2020 21:18 1.3K [TXT] 8.2.1118 02-Jul-2020 21:24 1.4K [   ] 8.2.1119 02-Jul-2020 22:51 2.5K [   ] 8.2.1120 03-Jul-2020 18:00 261K [   ] 8.2.1121 03-Jul-2020 18:15 2.9K [TXT] 8.2.1122 03-Jul-2020 21:10 5.0K [   ] 8.2.1123 03-Jul-2020 21:18 298K [TXT] 8.2.1124 04-Jul-2020 14:16 17K [TXT] 8.2.1125 04-Jul-2020 14:16 7.3K [TXT] 8.2.1126 04-Jul-2020 17:39 1.9K [TXT] 8.2.1127 04-Jul-2020 19:20 2.5K [TXT] 8.2.1128 05-Jul-2020 14:12 7.6K [   ] 8.2.1129 05-Jul-2020 14:59 4.3K [TXT] 8.2.1130 05-Jul-2020 15:33 2.1K [   ] 8.2.1131 05-Jul-2020 15:54 4.0K [TXT] 8.2.1132 05-Jul-2020 16:10 3.1K [TXT] 8.2.1133 05-Jul-2020 16:10 2.5K [TXT] 8.2.1134 05-Jul-2020 16:46 2.5K [TXT] 8.2.1135 05-Jul-2020 16:52 2.8K [TXT] 8.2.1136 05-Jul-2020 17:04 3.0K [TXT] 8.2.1137 05-Jul-2020 18:20 6.8K [TXT] 8.2.1138 05-Jul-2020 18:41 3.6K [   ] 8.2.1139 05-Jul-2020 18:49 2.5K [TXT] 8.2.1140 05-Jul-2020 20:09 2.5K [TXT] 8.2.1141 05-Jul-2020 20:17 2.8K [TXT] 8.2.1142 05-Jul-2020 20:47 2.7K [TXT] 8.2.1143 05-Jul-2020 20:56 3.4K [TXT] 8.2.1144 05-Jul-2020 21:11 2.5K [TXT] 8.2.1145 05-Jul-2020 21:38 4.9K [   ] 8.2.1146 06-Jul-2020 21:04 47K [TXT] 8.2.1147 06-Jul-2020 21:25 9.2K [   ] 8.2.1148 06-Jul-2020 21:55 3.1K [TXT] 8.2.1149 06-Jul-2020 23:07 3.3K [TXT] 8.2.1150 07-Jul-2020 20:13 6.1K [   ] 8.2.1151 07-Jul-2020 20:51 6.1K [TXT] 8.2.1152 07-Jul-2020 22:51 2.9K [   ] 8.2.1153 07-Jul-2020 23:33 1.8K [TXT] 8.2.1154 08-Jul-2020 15:17 9.2K [TXT] 8.2.1155 08-Jul-2020 17:37 17K [   ] 8.2.1156 08-Jul-2020 17:48 2.3K [   ] 8.2.1157 08-Jul-2020 18:35 2.8K [   ] 8.2.1158 08-Jul-2020 18:35 1.5K [   ] 8.2.1159 08-Jul-2020 18:39 3.0K [TXT] 8.2.1160 08-Jul-2020 19:36 3.1K [   ] 8.2.1161 08-Jul-2020 22:02 12K [   ] 8.2.1162 08-Jul-2020 22:24 1.9K [   ] 8.2.1163 08-Jul-2020 22:37 1.5K [TXT] 8.2.1164 08-Jul-2020 23:10 2.6K [TXT] 8.2.1165 09-Jul-2020 18:50 6.3K [TXT] 8.2.1166 09-Jul-2020 19:17 3.1K [   ] 8.2.1167 09-Jul-2020 21:21 10K [   ] 8.2.1168 09-Jul-2020 22:54 2.0K [   ] MD5SUMS 09-Jul-2020 22:54 49K [TXT] README 09-Jul-2020 22:54 70K

NLUUG - Open Systems. Open Standards
Become a member and get discounts on conferences and more, see the NLUUG website!